program: Orca
programVersion: 5.0.2
elementType: S S S P O O C C C C C C C C C H H H H H H H H H H H H H H H H H H H H H
charge: 0
multiplicity: 1
keywords: wb97x-d3
keywords: def2-TZVPP
keywords: def2/J RIJCOSX
keywords: DEFGRID2
keywords: scfconv7
keywords: smallprint printgap noloewdin
keywords: NOSOSCF
formula: C9H21O2PS3
InChI: InChI=1/C9H21O2PS3/c1-6-10-12(13,11-7-2)15-8-14-9(3,4)5/h6-8H2,1-5H3
36 atoms
S  1.865912 -1.413157 -0.684732
S  0.59644 1.206543 0.319763
S  -1.534812 0.82052 -2.294082
P  -1.283012 0.617621 -0.408078
O  -1.54632 -0.868152 0.090518
O  -2.201896 1.493286 0.577184
C  3.284717 -1.569346 0.477794
C  4.573627 -1.107107 -0.191456
C  3.04265 -0.805169 1.772549
C  3.355131 -3.06798 0.764072
C  1.669185 0.361555 -0.892762
C  -1.32984 -1.336044 1.426299
C  -2.471574 2.87388 0.294197
C  -2.636347 -1.450176 2.177935
C  -3.859168 3.037852 -0.278706
H  4.545285 -0.047778 -0.451485
H  5.420213 -1.245247 0.485732
H  4.771469 -1.670367 -1.102878
H  2.100917 -1.095517 2.23714
H  3.018432 0.274106 1.620677
H  3.850564 -1.013358 2.478588
H  2.44865 -3.423566 1.255183
H  3.495825 -3.647562 -0.149357
H  4.198787 -3.278227 1.424237
H  2.629905 0.874667 -0.855755
H  1.246788 0.528993 -1.884818
H  -0.847341 -2.307693 1.320509
H  -0.627589 -0.684884 1.953047
H  -2.369321 3.401866 1.24293
H  -1.722226 3.279316 -0.391185
H  -3.33768 -2.100077 1.656059
H  -2.452391 -1.879505 3.163511
H  -3.104496 -0.477069 2.316373
H  -4.61407 2.628606 0.392217
H  -4.07511 4.097165 -0.421843
H  -3.941312 2.53982 -1.243246
totalener: -2042.17966033 hartree
nucrepener: 1710.42317688 hartree
electener: -3752.60283722 hartree
oneelecener: -6215.67669938 hartree
twoeener: 2463.07386217 hartree
kineticenergy: 2037.00360163 hartree
xcener: -124.864349409055 hartree
chargesum: -0.0000000
charge: -0.109894 -0.173965 -0.377672 0.618922 -0.293794 -0.332432 0.143228 -0.295196 -0.306411 -0.277995 -0.153212 0.030786 0.008521 -0.235263 -0.217707 0.087174 0.087831 0.101115 0.097647 0.082488 0.095131 0.099838 0.104983 0.085296 0.123349 0.159865 0.094451 0.073267 0.095366 0.085985 0.089642 0.078492 0.083675 0.081573 0.077608 0.087308
qa: -0.1099 -0.1740 -0.3777 0.6189 -0.2938 -0.3324 0.1432 -0.2952 -0.3064 -0.2780 -0.1532 0.0308 0.0085 -0.2353 -0.2177 0.0872 0.0878 0.1011 0.0976 0.0825 0.0951 0.0998 0.1050 0.0853 0.1233 0.1599 0.0945 0.0733 0.0954 0.0860 0.0896 0.0785 0.0837 0.0816 0.0776 0.0873
va: 2.2624 2.2693 2.0833 5.4476 2.1439 2.0862 3.9185 3.9344 3.9401 3.8838 4.0070 3.8805 3.8938 3.9661 3.9296 1.0088 1.0058 1.0154 1.0077 1.0050 1.0106 1.0132 1.0118 1.0069 1.0119 1.0341 0.9947 1.0115 0.9932 1.0129 1.0052 1.0092 1.0153 1.0053 1.0107 1.0236
dispcorr: -0.017738069 hartree
energy: -2042.197398403794
dipole: 10.49887 -9.74800 0.75087 -5.92059 6.12063 0.20004 14.91672 -13.40140 1.51532
magnitude: 1.70294 au
magnitude: 4.32853 debye
