program: Orca
programVersion: 5.0.2
elementType: S S S P O O C C C C C C C C C H H H H H H H H H H H H H H H H H H H H H
charge: 0
multiplicity: 1
keywords: wb97x-d3
keywords: def2-TZVPP
keywords: def2/J RIJCOSX
keywords: DEFGRID2
keywords: scfconv7
keywords: smallprint printgap noloewdin
keywords: NOSOSCF
formula: C9H21O2PS3
InChI: InChI=1/C9H21O2PS3/c1-6-10-12(13,11-7-2)15-8-14-9(3,4)5/h6-8H2,1-5H3
36 atoms
S  2.817068 0.444681 0.776734
S  -0.178413 0.455339 1.024284
S  -0.999939 -0.432333 -2.158281
P  -1.622224 0.273675 -0.486066
O  -2.750052 -0.552795 0.3005
O  -2.32476 1.693656 -0.656022
C  3.108211 -1.175969 -0.053009
C  3.352692 -0.976777 -1.5439
C  4.376006 -1.694612 0.623402
C  1.955207 -2.144332 0.176705
C  1.277039 1.023972 0.063339
C  -2.783716 -1.985063 0.327992
C  -2.754203 2.501851 0.447329
C  -2.160439 -2.535724 1.590795
C  -1.938831 3.772468 0.4993
H  3.611485 -1.931877 -2.007012
H  2.464847 -0.608291 -2.059478
H  4.170029 -0.279275 -1.72473
H  5.214986 -1.009652 0.490699
H  4.657338 -2.653424 0.183935
H  4.226187 -1.84749 1.692812
H  1.733413 -2.257503 1.237612
H  1.045446 -1.825805 -0.331991
H  2.221435 -3.126131 -0.223125
H  1.303096 2.111937 0.076899
H  1.164382 0.699031 -0.971762
H  -3.838523 -2.253907 0.266347
H  -2.288819 -2.382979 -0.561552
H  -3.810219 2.716778 0.280663
H  -2.676139 1.96048 1.393083
H  -1.093563 -2.321265 1.641488
H  -2.636369 -2.124868 2.48074
H  -2.28646 -3.618474 1.61327
H  -0.892055 3.557222 0.714055
H  -1.995795 4.318997 -0.441436
H  -2.314682 4.421265 1.291074
totalener: -2042.18036006 hartree
nucrepener: 1713.53970636 hartree
electener: -3755.72006642 hartree
oneelecener: -6221.72428169 hartree
twoeener: 2466.00421528 hartree
kineticenergy: 2036.99879811 hartree
xcener: -124.865469028315 hartree
chargesum: 0.0000000
charge: -0.121532 -0.170535 -0.381746 0.635566 -0.328081 -0.309829 0.146801 -0.299847 -0.275903 -0.283692 -0.121157 0.023801 0.011818 -0.218627 -0.214541 0.086916 0.098222 0.098148 0.102392 0.084819 0.103481 0.098389 0.056615 0.090010 0.141318 0.105868 0.096232 0.082170 0.095937 0.080798 0.069761 0.088937 0.084784 0.066956 0.094121 0.081631
qa: -0.1215 -0.1705 -0.3817 0.6356 -0.3281 -0.3098 0.1468 -0.2998 -0.2759 -0.2837 -0.1212 0.0238 0.0118 -0.2186 -0.2145 0.0869 0.0982 0.0981 0.1024 0.0848 0.1035 0.0984 0.0566 0.0900 0.1413 0.1059 0.0962 0.0822 0.0959 0.0808 0.0698 0.0889 0.0848 0.0670 0.0941 0.0816
va: 2.2597 2.2758 2.0668 5.4298 2.1077 2.1488 3.9512 3.9430 3.8678 3.8959 3.9936 3.8921 3.9287 3.9096 3.9236 1.0062 1.0070 1.0150 1.0128 1.0069 1.0130 1.0109 1.0504 1.0142 0.9991 1.0684 0.9918 1.0214 0.9957 1.0021 1.0141 1.0062 1.0136 1.0138 1.0043 1.0126
dispcorr: -0.018584432 hartree
energy: -2042.198944487689
dipole: 9.95949 -10.25675 -0.29726 -7.82230 7.67125 -0.15104 5.26735 -4.48891 0.77844
magnitude: 0.84684 au
magnitude: 2.15250 debye
