program: Orca
programVersion: 5.0.2
elementType: S S S P O O C C C C C C C C C H H H H H H H H H H H H H H H H H H H H H
charge: 0
multiplicity: 1
keywords: wb97x-d3
keywords: def2-TZVPP
keywords: def2/J RIJCOSX
keywords: DEFGRID2
keywords: scfconv7
keywords: smallprint printgap noloewdin
keywords: NOSOSCF
formula: C9H21O2PS3
InChI: InChI=1/C9H21O2PS3/c1-6-10-12(13,11-7-2)15-8-14-9(3,4)5/h6-8H2,1-5H3
36 atoms
S  2.187851 0.377131 -0.937996
S  0.269655 -1.581248 0.496046
S  -1.424844 0.343416 -1.745137
P  -1.403351 -0.411096 0.024187
O  -2.56966 -1.43508 0.397832
O  -1.532499 0.616414 1.248046
C  3.70436 0.119206 0.073714
C  3.374911 -0.383547 1.472964
C  4.659427 -0.835111 -0.633019
C  4.324996 1.512834 0.151964
C  1.36817 -1.220863 -0.917009
C  -3.886502 -1.305128 -0.154923
C  -0.65392 1.745587 1.347907
C  -4.633456 -0.096025 0.362668
C  -1.340486 3.004318 0.869662
H  4.285707 -0.413834 2.076351
H  2.655344 0.263209 1.973711
H  2.960416 -1.391416 1.464575
H  5.58455 -0.934139 -0.060017
H  4.913247 -0.476048 -1.629847
H  4.240411 -1.837509 -0.733257
H  3.665583 2.215862 0.662088
H  5.262772 1.468575 0.709176
H  4.546216 1.912624 -0.838667
H  0.784306 -1.287654 -1.833625
H  2.092745 -2.03514 -0.925061
H  -3.818648 -1.277629 -1.245079
H  -4.394818 -2.225778 0.128665
H  -0.386985 1.820482 2.402859
H  0.269208 1.571133 0.786413
H  -4.186176 0.83411 0.013615
H  -5.65991 -0.12528 -0.00433
H  -4.662916 -0.079996 1.451252
H  -0.684324 3.861079 1.025906
H  -1.570384 2.94425 -0.193007
H  -2.264281 3.184566 1.419086
totalener: -2042.17939018 hartree
nucrepener: 1720.01156955 hartree
electener: -3762.19095973 hartree
oneelecener: -6235.03545576 hartree
twoeener: 2472.84449603 hartree
kineticenergy: 2037.01817996 hartree
xcener: -124.868676939997 hartree
chargesum: 0.0000000
charge: -0.118401 -0.144216 -0.403046 0.618363 -0.320994 -0.311701 0.149070 -0.300301 -0.294882 -0.280757 -0.158896 0.007244 0.056542 -0.223763 -0.241100 0.093354 0.099508 0.082601 0.088152 0.101241 0.086488 0.101216 0.085908 0.105153 0.155340 0.129824 0.091696 0.094702 0.092649 0.049723 0.079502 0.083482 0.089893 0.081333 0.090367 0.084706
qa: -0.1184 -0.1442 -0.4030 0.6184 -0.3210 -0.3117 0.1491 -0.3003 -0.2949 -0.2808 -0.1589 0.0072 0.0565 -0.2238 -0.2411 0.0934 0.0995 0.0826 0.0882 0.1012 0.0865 0.1012 0.0859 0.1052 0.1553 0.1298 0.0917 0.0947 0.0926 0.0497 0.0795 0.0835 0.0899 0.0813 0.0904 0.0847
va: 2.2752 2.2957 2.0354 5.4225 2.1428 2.0996 3.9156 3.9406 3.9328 3.8876 4.0043 3.9176 3.8642 3.8868 3.9352 1.0091 1.0097 1.0055 1.0061 1.0152 1.0090 1.0099 1.0069 1.0114 1.0294 1.0123 1.0102 0.9904 0.9951 1.0505 1.0182 1.0118 1.0075 1.0142 1.0208 1.0047
dispcorr: -0.017929159 hartree
energy: -2042.197319338071
dipole: 12.59796 -12.11998 0.47798 8.84275 -8.83270 0.01005 6.65785 -6.00793 0.64992
magnitude: 0.80682 au
magnitude: 2.05078 debye
