program: Orca
programVersion: 5.0.2
elementType: S S S P O O C C C C C C C C C H H H H H H H H H H H H H H H H H H H H H
charge: 0
multiplicity: 1
keywords: wb97x-d3
keywords: def2-TZVPP
keywords: def2/J RIJCOSX
keywords: DEFGRID2
keywords: scfconv7
keywords: smallprint printgap noloewdin
keywords: NOSOSCF
formula: C9H21O2PS3
InChI: InChI=1/C9H21O2PS3/c1-6-10-12(13,11-7-2)15-8-14-9(3,4)5/h6-8H2,1-5H3
36 atoms
S  2.034117 -0.149155 -0.994544
S  -0.004289 -0.776646 1.243641
S  -1.545927 0.07854 -1.679661
P  -1.612613 0.106187 0.243234
O  -2.817993 -0.665103 0.956331
O  -1.783208 1.558278 0.906038
C  3.600835 -0.155736 -0.02661
C  4.393963 1.007331 -0.619478
C  3.352733 0.086981 1.456286
C  4.354626 -1.462212 -0.242863
C  1.011582 -1.365751 -0.15903
C  -4.167285 -0.438886 0.51731
C  -1.201859 2.742573 0.353235
C  -4.657507 -1.613784 -0.296178
C  0.250778 2.909538 0.739017
H  3.881877 1.958012 -0.467444
H  5.371676 1.071814 -0.138047
H  4.559454 0.878458 -1.690117
H  2.767336 0.990323 1.623978
H  4.307962 0.197021 1.975776
H  2.825699 -0.74147 1.930527
H  4.558399 -1.632618 -1.299434
H  5.309011 -1.439629 0.289128
H  3.801006 -2.323465 0.134567
H  0.350866 -1.797212 -0.90864
H  1.617206 -2.174217 0.250912
H  -4.760576 -0.306308 1.422343
H  -4.242313 0.484638 -0.062634
H  -1.314165 2.733276 -0.733889
H  -1.80474 3.561202 0.746534
H  -5.701891 -1.462142 -0.571054
H  -4.077775 -1.72026 -1.211708
H  -4.589949 -2.542097 0.269962
H  0.600306 3.887319 0.405258
H  0.384035 2.853759 1.81922
H  0.879375 2.15269 0.269727
totalener: -2042.17900837 hartree
nucrepener: 1715.94630703 hartree
electener: -3758.12531539 hartree
oneelecener: -6226.96364694 hartree
twoeener: 2468.83833155 hartree
kineticenergy: 2037.01122263 hartree
xcener: -124.866904298677 hartree
chargesum: 0.0000000
charge: -0.116481 -0.135632 -0.403892 0.625705 -0.318032 -0.324543 0.152575 -0.283631 -0.302965 -0.289539 -0.153909 0.022158 0.029255 -0.221011 -0.220887 0.103426 0.085987 0.104132 0.103262 0.094316 0.077959 0.099935 0.087621 0.085305 0.151427 0.127814 0.092354 0.077736 0.090549 0.091411 0.077522 0.083830 0.084571 0.082947 0.088369 0.050356
qa: -0.1165 -0.1356 -0.4039 0.6257 -0.3180 -0.3245 0.1526 -0.2836 -0.3030 -0.2895 -0.1539 0.0222 0.0293 -0.2210 -0.2209 0.1034 0.0860 0.1041 0.1033 0.0943 0.0780 0.0999 0.0876 0.0853 0.1514 0.1278 0.0924 0.0777 0.0905 0.0914 0.0775 0.0838 0.0846 0.0829 0.0884 0.0504
va: 2.2684 2.2941 2.0406 5.4242 2.1363 2.1127 3.9058 3.8979 3.9437 3.9346 4.0000 3.9233 3.8959 3.9229 3.8781 1.0069 1.0067 1.0110 1.0052 1.0100 1.0039 1.0157 1.0060 1.0089 1.0309 1.0145 0.9944 1.0066 1.0157 0.9909 1.0107 1.0225 1.0054 1.0182 1.0058 1.0541
dispcorr: -0.017962921 hartree
energy: -2042.196971289012
dipole: 15.81362 -15.44661 0.36701 3.27018 -3.05477 0.21541 2.60057 -2.00962 0.59095
magnitude: 0.72823 au
magnitude: 1.85102 debye
