program: Orca
programVersion: 5.0.2
elementType: S S S P O O C C C C C C C C C H H H H H H H H H H H H H H H H H H H H H
charge: 0
multiplicity: 1
keywords: wb97x-d3
keywords: def2-TZVPP
keywords: def2/J RIJCOSX
keywords: DEFGRID2
keywords: scfconv7
keywords: smallprint printgap noloewdin
keywords: NOSOSCF
formula: C9H21O2PS3
InChI: InChI=1/C9H21O2PS3/c1-6-10-12(13,11-7-2)15-8-14-9(3,4)5/h6-8H2,1-5H3
36 atoms
S  3.149587 0.394613 0.446177
S  0.212945 0.802506 0.935835
S  -1.01757 -0.712841 -1.85455
P  -1.40692 0.381022 -0.327096
O  -2.435086 -0.191349 0.768004
O  -2.088981 1.76125 -0.735811
C  3.227621 -1.391244 -0.004031
C  3.363071 -1.552406 -1.513207
C  4.496039 -1.877762 0.694138
C  2.017683 -2.158738 0.51187
C  1.595743 0.948583 -0.258854
C  -2.278622 -1.521458 1.286555
C  -2.533203 2.743282 0.209009
C  -3.240734 -2.476353 0.619972
C  -4.034246 2.692167 0.377336
H  2.473564 -1.208233 -2.042756
H  4.223513 -1.004875 -1.896532
H  3.491354 -2.608077 -1.764867
H  5.378581 -1.331475 0.357813
H  4.654097 -2.934159 0.469241
H  4.422379 -1.773665 1.777102
H  1.875148 -2.008605 1.581597
H  1.100762 -1.867373 -0.001435
H  2.162667 -3.227046 0.331542
H  1.714337 1.996602 -0.525895
H  1.340672 0.393422 -1.162793
H  -1.246929 -1.862719 1.162796
H  -2.469588 -1.449427 2.357521
H  -2.023989 2.619972 1.168679
H  -2.22273 3.706118 -0.197811
H  -4.272478 -2.146793 0.738137
H  -3.024185 -2.571345 -0.442882
H  -3.149121 -3.462943 1.075434
H  -4.355456 1.751444 0.820512
H  -4.355303 3.502395 1.03274
H  -4.541338 2.814681 -0.579042
totalener: -2042.18097179 hartree
nucrepener: 1701.19732905 hartree
electener: -3743.37830084 hartree
oneelecener: -6197.08983571 hartree
twoeener: 2453.71153487 hartree
kineticenergy: 2036.99320921 hartree
xcener: -124.863467031337 hartree
chargesum: -0.0000000
charge: -0.122425 -0.166025 -0.382783 0.629951 -0.328170 -0.311206 0.145609 -0.297128 -0.276523 -0.280289 -0.115775 0.014289 0.028036 -0.217636 -0.237656 0.098282 0.097706 0.085959 0.102657 0.084240 0.103579 0.100991 0.045736 0.089882 0.147045 0.101294 0.081154 0.097040 0.082667 0.095115 0.083777 0.087544 0.077869 0.085697 0.080889 0.088609
qa: -0.1224 -0.1660 -0.3828 0.6300 -0.3282 -0.3112 0.1456 -0.2971 -0.2765 -0.2803 -0.1158 0.0143 0.0280 -0.2176 -0.2377 0.0983 0.0977 0.0860 0.1027 0.0842 0.1036 0.1010 0.0457 0.0899 0.1470 0.1013 0.0812 0.0970 0.0827 0.0951 0.0838 0.0875 0.0779 0.0857 0.0809 0.0886
va: 2.2571 2.2882 2.0588 5.4247 2.0872 2.1505 3.9567 3.9434 3.8695 3.8938 3.9739 3.9190 3.8932 3.9273 3.9308 1.0061 1.0152 1.0062 1.0126 1.0069 1.0134 1.0123 1.0522 1.0146 1.0030 1.0728 0.9945 0.9947 1.0087 0.9925 1.0060 1.0252 1.0103 1.0159 1.0096 1.0054
dispcorr: -0.018026215 hartree
energy: -2042.198998004338
dipole: 2.75895 -3.11894 -0.35999 -11.21178 11.14797 -0.06381 4.13175 -3.31425 0.81750
magnitude: 0.89553 au
magnitude: 2.27626 debye
