program: Orca
programVersion: 5.0.2
elementType: S S S P O O C C C C C C C C C H H H H H H H H H H H H H H H H H H H H H
charge: 0
multiplicity: 1
keywords: wb97x-d3
keywords: def2-TZVPP
keywords: def2/J RIJCOSX
keywords: DEFGRID2
keywords: scfconv7
keywords: smallprint printgap noloewdin
keywords: NOSOSCF
formula: C9H21O2PS3
InChI: InChI=1/C9H21O2PS3/c1-6-10-12(13,11-7-2)15-8-14-9(3,4)5/h6-8H2,1-5H3
36 atoms
S  3.149563 0.397301 0.435028
S  0.21356 0.802446 0.929332
S  -1.026168 -0.730148 -1.845366
P  -1.412114 0.373094 -0.323692
O  -2.436189 -0.194107 0.777872
O  -2.096405 1.750604 -0.73783
C  3.227843 -1.392678 0.001054
C  3.359818 -1.568018 -1.506828
C  4.498867 -1.870342 0.700626
C  2.020628 -2.157291 0.527492
C  1.592384 0.941326 -0.270461
C  -2.27584 -1.520756 1.304059
C  -2.532938 2.74012 0.202729
C  -3.242912 -2.479593 0.650679
C  -4.032708 2.691576 0.382323
H  2.468621 -1.229723 -2.037293
H  4.218663 -1.023144 -1.897465
H  3.488694 -2.625856 -1.748934
H  4.658274 -2.928461 0.484969
H  4.427717 -1.756517 1.78278
H  5.379672 -1.325659 0.357215
H  1.880706 -1.997396 1.596149
H  1.101861 -1.872058 0.014008
H  2.166726 -3.22703 0.356778
H  1.707699 1.987277 -0.546855
H  1.335149 0.377985 -1.168721
H  -1.245206 -1.863204 1.17479
H  -2.45875 -1.441931 2.375951
H  -2.016867 2.623391 1.159564
H  -2.224403 3.69954 -0.213527
H  -3.148605 -3.463349 1.111691
H  -4.273566 -2.148555 0.773975
H  -3.033672 -2.581289 -0.413046
H  -4.348348 3.508195 1.032406
H  -4.546545 2.805542 -0.57151
H  -4.351368 1.755257 0.836589
totalener: -2042.18098032 hartree
nucrepener: 1700.99698793 hartree
electener: -3743.17796824 hartree
oneelecener: -6196.68773575 hartree
twoeener: 2453.50976750 hartree
kineticenergy: 2036.99284547 hartree
xcener: -124.863398001634 hartree
chargesum: 0.0000000
charge: -0.122163 -0.166322 -0.383057 0.629945 -0.328052 -0.311149 0.145900 -0.297100 -0.276681 -0.280809 -0.115763 0.014147 0.027863 -0.217556 -0.237464 0.098345 0.097660 0.085927 0.084191 0.103617 0.102679 0.101084 0.045979 0.089977 0.146986 0.101297 0.081332 0.097018 0.082660 0.095164 0.077858 0.083818 0.087502 0.080907 0.088534 0.085727
qa: -0.1222 -0.1663 -0.3831 0.6299 -0.3281 -0.3111 0.1459 -0.2971 -0.2767 -0.2808 -0.1158 0.0141 0.0279 -0.2176 -0.2375 0.0983 0.0977 0.0859 0.0842 0.1036 0.1027 0.1011 0.0460 0.0900 0.1470 0.1013 0.0813 0.0970 0.0827 0.0952 0.0779 0.0838 0.0875 0.0809 0.0885 0.0857
va: 2.2573 2.2880 2.0587 5.4250 2.0876 2.1506 3.9564 3.9435 3.8695 3.8941 3.9741 3.9192 3.8933 3.9275 3.9308 1.0061 1.0152 1.0062 1.0069 1.0134 1.0126 1.0123 1.0518 1.0145 1.0029 1.0728 0.9944 0.9947 1.0088 0.9924 1.0104 1.0060 1.0251 1.0097 1.0054 1.0159
dispcorr: -0.018017600 hartree
energy: -2042.198997918523
dipole: 2.80747 -3.16098 -0.35351 -11.17490 11.11632 -0.05857 4.25280 -3.43077 0.82204
magnitude: 0.89674 au
magnitude: 2.27934 debye
