program: Gaussian 09
title: 000066734
version: EM64L-G09RevD.01
frameworkgroup: C1[X(C17H12O2)]
method: RPBEPBE
basis: SDD
operation: Freq
keyword: #pfreq=noraman
keyword: PBEPBE/SDD
title: #p freq=noraman PBEPBE/SDD
converged: YES YES NO NO
title: Mulliken charges:
elementType: O O C C C C C C C C C C C C C C C C C H H H H H H H H H H H H
charge: -0.343208 -0.213072 0.396271 0.380712 -0.544551 0.428615 -0.399298 -0.414236 -0.408257 -0.370949 -0.240965 -0.239723 0.237580 0.126639 -0.332451 -0.331769 -0.221776 -0.218013 -0.221167 0.255872 0.239298 0.240801 0.248650 0.240228 0.229466 0.229165 0.269728 0.275084 0.234715 0.232906 0.233704
chargesum: 0.00000
title: Mulliken charges with hydrogens summed into heavy atoms:
elementType: O O C C C C C C C C C C C C C C C C C
charge: -0.343208 -0.213072 0.396271 0.380712 -0.288679 0.428615 -0.159999 -0.173435 -0.168028 -0.122299 -0.011499 -0.010558 0.237580 0.126639 -0.062723 -0.056685 0.012940 0.014893 0.012536
polarizability: 3.17835393e+02 -8.02045159e+00 1.45561055e+02 1.00854911e+01 4.63670410e-01 1.25304774e+02
1716.lowfreq: -27.7546 -0.0006 0.0003 0.0006 4.9137 6.6484 11.8694 31.3270 44.3369
frequency: -27.5348 31.3001 44.2912 54.7200 124.1660 159.2137 167.2957 180.4968 269.8397 289.0442 314.9034 398.0690 403.6216 417.9044 430.0927 451.5918 476.9117 503.6371 517.1663 523.5390 614.0174 619.6920 630.4182 663.9706 673.2729 701.0172 720.0049 752.7461 758.1506 776.3591 786.8895 795.2031 826.0151 865.7350 873.8437 883.2736 909.7312 947.3040 956.3176 957.6131 973.2590 989.9576 992.6293 997.3796 1000.0275 1009.7199 1023.8225 1032.4625 1085.1343 1117.9678 1141.4221 1150.0183 1173.8436 1174.4635 1182.8678 1224.5701 1236.7739 1249.6502 1271.6086 1316.1037 1348.4682 1390.4493 1410.6646 1424.3225 1435.1852 1438.4870 1458.4740 1477.9967 1515.6451 1586.5542 1587.6835 1603.3129 1611.4603 1639.0093 1647.3286 3122.2130 3128.1078 3131.2703 3133.7489 3144.2632 3144.6423 3151.8514 3155.9735 3163.5051 3168.1482 3168.3447 3182.0101
redmass: 5.4547 6.1121 5.6384 5.0179 5.5013 5.3922 6.4267 3.6817 5.6540 6.1549 5.9136 3.3282 2.8305 4.5918 5.7088 4.4995 2.4962 7.2194 6.2542 4.1735 6.4376 6.7959 3.9524 5.0314 5.0940 1.6258 4.1537 1.7628 4.6375 2.4887 3.0376 2.1179 1.4252 1.2443 1.6468 4.9211 1.7366 4.5800 1.4180 1.3726 1.4066 6.3906 1.3470 1.3871 6.1086 1.3287 2.2701 2.0734 1.5771 1.8281 1.8011 1.2481 1.0776 1.0572 1.1328 2.8030 2.2164 1.9315 1.8188 1.3149 1.8286 10.0449 5.6856 4.0169 3.0702 2.2457 2.4754 2.2908 3.8619 7.6115 6.5220 5.9079 6.0585 7.7538 10.3176 1.0857 1.0889 1.0856 1.0889 1.0892 1.0951 1.0928 1.0941 1.1005 1.0985 1.0966 1.0971
irintensity: 0.2267 1.0985 1.2544 0.3295 0.0060 0.1703 0.8960 1.3369 2.7116 0.4703 6.8598 0.4259 0.0018 3.6888 1.4812 1.1592 24.5763 1.4115 0.0482 2.1838 1.0874 0.5238 5.2554 10.7088 17.4934 83.2685 3.6278 34.5461 1.8781 10.2622 16.0546 25.5695 34.2677 0.0528 35.4869 2.7402 16.6967 19.1293 3.7749 1.7870 6.8332 33.7420 0.5933 0.7801 437.2234 0.2890 0.9695 62.2388 9.1052 71.9434 201.3845 31.6724 0.4875 0.2082 59.2499 406.5436 30.1127 17.0061 8.2787 0.6770 4.1150 3.2021 8.7772 1.3355 2.3978 18.5323 21.8342 4.3678 33.1907 4.7631 16.1982 31.4229 11.9522 39.3322 169.4320 2.9446 0.4885 0.2835 8.1749 10.1790 31.3314 7.4057 17.0494 38.2247 24.8817 6.0768 6.5930
temp: 298.150 k
press: 1.00000 atm
elementType: 8 8 6 6 6 6 6 6 6 6 6 6 6 6 6 6 6 6 6 1 1 1 1 1 1 1 1 1 1 1 1
symmnumber: 1
zpe: 623147.8 jmol-1
zpe.correction: 0.237344 hartree
zpe.thermalcorrener: 0.251241 hartree
zpe.thermalcorrenthalpy: 0.252185 hartree
zpe.thermalcorrgfe: 0.195336 hartree
zpe.sumelectzpe: -804.183618 hartree
zpe.sumelectthermal: -804.169721 hartree
zpe.sumelectthermalent: -804.168777 hartree
zpe.sumelectthermalfe: -804.225626 hartree
dipole: -0.7781 -0.0259 -1.6753
dipole: 1.8474
quadrupole: -78.8775 -101.3437 -113.9325
quadrupole: 1.6502 2.6744 0.2431
quadrupole: 19.1737 -3.2924 -15.8813 1.6502 2.6744 0.2431
hfenergy: -804.4209621 hartree
pointgroup: C01 [X(C17H12O2)]
dipole: 0.3052634 0.3070336 -0.5838033 debye
polarizability: 317.7194476|-3.2361071|141.7858014|-13.2730351|7.9815974|129.1959728 unknown
InChI: InChI=1S/C17H12O2/c18-17(14-7-2-1-3-8-14)19-16-11-10-13-6-4-5-9-15(13)12-16/h1-12H
charge 0 multiplicity 1
31 atoms
O  0.850773 0.030287 -0.552717
O  1.271108 -0.882695 1.568096
C  -2.789201 0.612918 0.151952
C  -3.353481 -0.623847 -0.35337
C  -1.369585 0.80451 0.102416
C  -0.560359 -0.195098 -0.425053
C  -2.473063 -1.622788 -0.887869
C  -3.669521 1.610643 0.688165
C  -4.77435 -0.811449 -0.303045
C  -1.093846 -1.418944 -0.926192
C  -5.049313 1.398156 0.724619
C  -5.607184 0.177616 0.224756
C  3.127283 -0.065845 0.2027
C  1.700922 -0.361796 0.517876
C  4.104716 -0.406478 1.174631
C  3.522694 0.535177 -1.021008
C  5.467379 -0.148227 0.923909
C  4.888044 0.791659 -1.266301
C  5.861333 0.451159 -0.296747
H  -0.923663 1.731079 0.479038
H  -2.899316 -2.557932 -1.26895
H  -3.242243 2.544286 1.072589
H  -0.412317 -2.173344 -1.330644
H  -5.198988 -1.747406 -0.68536
H  -5.713158 2.165529 1.137548
H  -6.691309 0.024631 0.259988
H  3.774976 -0.869033 2.110895
H  2.759895 0.79227 -1.760692
H  6.220701 -0.411759 1.673929
H  5.194713 1.255454 -2.209966
H  6.920963 0.651868 -0.490994
