program: Orca
programVersion: 5.0.2
elementType: S S S P P O O O O O O C C C C C C C C C C C C C C C C H H H H H H H H H H H H H H H H H H H H
charge: 0
multiplicity: 1
keywords: wb97x-d3
keywords: def2-TZVPP
keywords: def2/J RIJCOSX
keywords: DEFGRID2
keywords: scfconv7
keywords: smallprint printgap noloewdin
keywords: NOSOSCF
formula: C16H20O6P2S3
InChI: InChI=1/C16H20O6P2S3/c1-17-23(25,18-2)21-13-5-9-15(10-6-13)27-16-11-7-14(8-12-16)22-24(26,19-3)20-4/h5-12H,1-4H3
47 atoms
S  -0.063136 -3.884817 -0.188152
S  -2.881915 2.004725 1.864422
S  3.479367 1.389063 -2.726539
P  -4.522615 1.313198 1.159209
P  4.525374 1.22726 -1.130441
O  -4.609785 -0.296502 1.011374
O  4.595982 -0.243709 -0.45973
O  -4.949393 1.760359 -0.306761
O  -5.857162 1.605879 1.974808
O  6.078337 1.563165 -1.234301
O  4.087119 2.108836 0.120395
C  -1.401314 -2.778669 0.166407
C  1.300743 -2.754966 -0.262708
C  -3.525779 -1.095382 0.715095
C  3.485002 -1.065175 -0.397178
C  -2.15807 -2.964231 1.315994
C  1.476573 -1.762163 0.697928
C  -1.727118 -1.753007 -0.717001
C  2.236849 -2.903739 -1.279942
C  -3.225451 -2.121429 1.593093
C  2.562017 -0.905395 0.625495
C  -2.783658 -0.902522 -0.442478
C  3.3356 -2.05934 -1.347352
C  -4.797143 3.116542 -0.747209
C  -5.903311 1.448964 3.398524
C  6.853451 1.104424 -2.349562
C  3.566347 3.434165 -0.054164
H  -1.910307 -3.754677 2.011811
H  0.765014 -1.645349 1.505074
H  -1.153457 -1.61064 -1.623527
H  2.107326 -3.667516 -2.035556
H  -3.811667 -2.258079 2.492334
H  2.694869 -0.134419 1.373101
H  -3.03276 -0.115041 -1.141519
H  4.063219 -2.172297 -2.140166
H  -3.762372 3.444145 -0.65266
H  -5.446551 3.786251 -0.184531
H  -5.08509 3.133834 -1.794546
H  -5.196646 2.119076 3.887057
H  -6.913776 1.705348 3.704119
H  -5.691691 0.41985 3.688806
H  6.460966 1.499606 -3.285882
H  7.863205 1.474983 -2.197631
H  6.873842 0.015577 -2.393868
H  2.658065 3.419118 -0.655162
H  3.334589 3.80587 0.939834
H  4.301575 4.089327 -0.520055
elementType: S P O C H
totalener: -2950.72185276 hartree
nucrepener: 3358.60412871 hartree
electener: -6309.32598147 hartree
twoeener: 4440.09253641 hartree
cpcmener: -0.03558417 hartree
kineticenergy: 2942.56344435 hartree
xcener: -192.747908460227 hartree
chargesum: -0.0000000
charge: -0.064410 -0.450760 -0.453555 0.770746 0.777677 -0.341737 -0.358035 -0.345300 -0.344794 -0.345869 -0.347807 0.036513 0.041825 0.232795 0.236922 -0.136449 -0.145246 -0.127181 -0.143361 -0.181997 -0.172028 -0.169419 -0.185528 -0.116132 -0.116185 -0.113495 -0.116087 0.137265 0.150374 0.147830 0.136433 0.154479 0.156478 0.155962 0.152546 0.111961 0.131561 0.131006 0.111233 0.131497 0.127348 0.110529 0.131593 0.127274 0.113995 0.130321 0.129215
qa: -0.0644 -0.4508 -0.4536 0.7707 0.7777 -0.3417 -0.3580 -0.3453 -0.3448 -0.3459 -0.3478 0.0365 0.0418 0.2328 0.2369 -0.1364 -0.1452 -0.1272 -0.1434 -0.1820 -0.1720 -0.1694 -0.1855 -0.1161 -0.1162 -0.1135 -0.1161 0.1373 0.1504 0.1478 0.1364 0.1545 0.1565 0.1560 0.1525 0.1120 0.1316 0.1310 0.1112 0.1315 0.1273 0.1105 0.1316 0.1273 0.1140 0.1303 0.1292
va: 2.3008 1.9820 1.9831 5.4744 5.4775 2.1114 2.0944 2.0928 2.1021 2.0969 2.1017 3.7014 3.7387 3.7233 3.7026 3.9732 3.9256 3.9574 3.9651 4.0226 4.0313 3.9674 4.0306 3.8331 3.8428 3.8395 3.8385 1.0132 0.9920 0.9968 1.0130 0.9970 1.0050 1.0057 0.9984 1.0001 0.9877 0.9904 0.9995 0.9904 0.9849 1.0002 0.9908 0.9854 0.9988 0.9914 0.9864
dispcorr: -0.023608701 hartree
energy: -2950.745461462994
dipole: -0.75933 0.38952 -0.36981 10.08877 -8.96631 1.12247 1.05106 -0.63162 0.41944
magnitude: 1.25404 au
magnitude: 3.18752 debye
