program: Gaussian 09
title: 000066725
version: EM64L-G09RevD.01
frameworkgroup: C1[X(C12H14N2)]
method: RPBEPBE
basis: SDD
operation: Freq
keyword: #pfreq=noraman
keyword: PBEPBE/SDD
title: #p freq=noraman PBEPBE/SDD
converged: NO YES NO NO
title: Mulliken charges:
elementType: N N C C C C C C C C C C C C H H H H H H H H H H H H H H
charge: -0.160493 -0.032806 0.413170 0.504859 -0.142883 -0.564653 -0.342032 -0.355600 -0.331827 0.141491 -0.313071 -0.643979 -0.647518 -0.789691 0.239813 0.240102 0.254421 0.236095 0.228978 0.234082 0.233752 0.216343 0.233786 0.217128 0.233801 0.250729 0.222999 0.223004
chargesum: 0.00000
title: Mulliken charges with hydrogens summed into heavy atoms:
elementType: N N C C C C C C C C C C C C
charge: -0.160493 -0.032806 0.413170 0.504859 -0.142883 -0.324840 -0.101930 -0.101178 -0.095732 0.141491 -0.084094 0.040198 0.037198 -0.092959
polarizability: 2.60375015e+02 1.08302557e+01 1.41913649e+02 -1.96390759e-02 -3.28062378e-02 7.18708776e+01
1716.lowfreq: -10.5319 -6.0952 -0.0008 -0.0006 -0.0002 10.2393 51.2777 62.6017 83.3931
frequency: 50.7124 62.5431 83.3684 100.4356 158.8298 163.1017 164.5773 214.6775 253.4159 271.0130 316.4606 365.3205 397.3418 416.7090 474.2441 478.7398 504.6812 532.1687 570.4429 579.8813 652.8151 673.9618 730.3102 781.0230 803.7075 806.9242 828.7998 869.5652 886.9100 933.5057 962.8344 968.2580 975.4981 1003.0721 1043.9542 1055.4119 1106.4390 1110.8882 1119.1442 1144.4327 1165.5690 1220.0628 1242.6739 1265.0361 1272.9797 1300.6454 1343.0536 1375.6523 1387.9858 1396.3283 1417.0918 1431.2007 1452.2344 1462.3652 1463.2638 1468.4847 1474.2512 1481.5276 1493.7524 1506.2994 1516.4717 1548.9038 1594.0100 1636.9149 2933.0012 2943.0799 2974.8660 2995.0441 3004.2046 3049.9149 3091.7724 3102.6812 3112.8467 3116.0198 3143.8386 3145.7760 3146.4839 3169.3827
redmass: 2.7623 3.0399 1.0858 1.6558 1.9120 2.1174 3.2190 1.5103 2.4869 3.1690 3.8538 3.7212 3.2805 3.7894 3.2145 3.0643 3.8794 6.3726 2.8560 4.7085 5.8474 2.8724 6.0512 2.0479 4.9131 1.4639 1.8707 1.9341 4.3746 3.3453 2.4717 1.3477 1.3347 1.8025 1.5635 1.5021 1.2678 1.2895 1.6342 1.4225 1.2870 1.7476 2.3154 3.4095 1.9355 2.8164 3.5010 3.6132 1.2858 2.9799 4.0399 1.2355 1.3030 1.0405 1.1713 1.0470 1.0465 2.1483 1.2004 1.4896 1.9920 6.3269 6.3373 6.4349 1.0372 1.0392 1.0383 1.1002 1.1018 1.0972 1.0960 1.0938 1.0973 1.0877 1.0959 1.0917 1.0870 1.0965
irintensity: 2.9695 0.9349 0.0013 2.7492 0.0057 1.4397 1.4640 2.8175 8.3199 1.8818 0.3474 0.0086 2.2507 0.9474 1.2972 6.0028 3.7492 1.4423 0.1027 3.9567 0.6996 4.5873 0.8705 0.0711 1.1844 0.0700 62.3676 55.0284 6.6869 1.8633 20.9657 0.8946 1.9060 5.8371 6.6620 25.3627 0.4089 0.6174 26.3806 0.5619 16.5019 13.8557 0.0652 32.6716 4.5012 2.6156 59.6153 105.4558 30.5322 0.1839 6.2945 8.7060 10.2168 0.2496 15.5856 15.0383 21.3333 20.6529 3.0762 0.1830 250.5419 14.2172 85.5630 232.9612 100.6348 116.0519 40.5080 35.1646 59.5962 24.6828 4.0910 49.8983 12.4198 6.2141 21.0779 30.0328 3.2422 17.6938
temp: 298.150 k
press: 1.00000 atm
elementType: 7 7 6 6 6 6 6 6 6 6 6 6 6 6 1 1 1 1 1 1 1 1 1 1 1 1 1 1
symmnumber: 1
zpe: 606876.3 jmol-1
zpe.correction: 0.231147 hartree
zpe.thermalcorrener: 0.244407 hartree
zpe.thermalcorrenthalpy: 0.245351 hartree
zpe.thermalcorrgfe: 0.191208 hartree
zpe.sumelectzpe: -574.169062 hartree
zpe.sumelectthermal: -574.155802 hartree
zpe.sumelectthermalent: -574.154858 hartree
zpe.sumelectthermalfe: -574.209002 hartree
dipole: -3.7135 2.0274 0.0054
dipole: 4.2308
quadrupole: -63.5814 -77.4587 -88.2590
quadrupole: 4.9646 -0.0196 0.0020
quadrupole: 12.8516 -1.0257 -11.8259 4.9646 -0.0196 0.0020
hfenergy: -574.4002094 hartree
pointgroup: C01 [X(C12H14N2)]
dipole: 1.4524532 0.8130676 -0.0026946 debye
polarizability: 260.5912528|-9.5724124|141.6974181|-0.0411736|0.000348|71.8708701 unknown
InChI: InChI=1S/C12H14N2/c1-9-4-5-10-8-11(14(2)3)6-7-12(10)13-9/h4-8H,1-3H3
charge 0 multiplicity 1
28 atoms
N  3.288539 0.200934 0.00163
N  -2.250015 -1.043921 -0.000248
C  1.914744 -0.068241 0.000514
C  -0.44442 0.681241 -0.00004
C  -0.907186 -0.692388 -0.000121
C  0.95105 0.970389 0.000116
C  1.437982 -1.435456 -0.000099
C  0.077762 -1.729971 -0.000281
C  -1.458842 1.698419 -0.000075
C  -3.175546 -0.058412 -0.000222
C  -2.803952 1.333456 -0.000145
C  4.267636 -0.893428 0.00011
C  3.749972 1.592576 -0.005098
C  -4.635592 -0.465298 -0.000326
H  1.260678 2.020417 0.000392
H  2.156168 -2.26021 -0.000879
H  -0.275954 -2.765961 -0.000796
H  -1.166298 2.755616 -0.00002
H  -3.591305 2.095724 -0.000138
H  4.166157 -1.54332 0.893179
H  4.175879 -1.534077 -0.900958
H  5.284526 -0.469789 0.008302
H  3.396004 2.14736 0.888799
H  4.851134 1.617277 -0.0059
H  3.394644 2.139533 -0.903334
H  -4.710119 -1.563808 -0.000185
H  -5.163267 -0.072403 0.889852
H  -5.163081 -0.07266 -0.890731
