program: Orca
programVersion: 5.0.2
elementType: S S S P P O O O O O O C C C C C C C C C C C C C C C C H H H H H H H H H H H H H H H H H H H H
charge: 0
multiplicity: 1
keywords: wb97x-d3
keywords: def2-TZVPP
keywords: def2/J RIJCOSX
keywords: DEFGRID2
keywords: scfconv7
keywords: smallprint printgap noloewdin
keywords: NOSOSCF
formula: C16H20O6P2S3
InChI: InChI=1/C16H20O6P2S3/c1-17-23(25,18-2)21-13-5-9-15(10-6-13)27-16-11-7-14(8-12-16)22-24(26,19-3)20-4/h5-12H,1-4H3
47 atoms
S  -0.133195 -3.89574 -0.439025
S  -2.818285 1.962875 1.80717
S  3.782657 1.267051 -2.707227
P  -4.482493 1.349775 1.085068
P  4.535387 1.142452 -0.949555
O  -4.608077 -0.245048 0.83969
O  4.597648 -0.339053 -0.300392
O  -4.918141 1.891838 -0.346834
O  -5.797306 1.624308 1.939251
O  6.049666 1.59672 -0.767686
O  3.801858 1.942127 0.215862
C  -1.449914 -2.771788 -0.059005
C  1.26326 -2.805188 -0.384956
C  -3.53904 -1.058251 0.529397
C  3.4823 -1.159129 -0.327764
C  -1.71542 -1.68302 -0.885317
C  1.431804 -1.896208 0.656055
C  -2.2479 -3.00272 1.053815
C  2.227643 -2.899776 -1.381737
C  -2.754464 -0.81784 -0.590223
C  2.534673 -1.060062 0.679718
C  -3.298012 -2.145137 1.350536
C  3.34495 -2.07748 -1.352921
C  -4.780026 3.27981 -0.680851
C  -5.812939 1.405479 3.355945
C  7.03598 1.311147 -1.768386
C  3.266619 3.253727 -0.010597
H  -1.108255 -1.502574 -1.762601
H  0.699225 -1.82693 1.449711
H  -2.04584 -3.841801 1.70596
H  2.105541 -3.600331 -2.197489
H  -2.958383 0.01925 -1.244879
H  2.660905 -0.351981 1.487879
H  -3.915922 -2.317561 2.221928
H  4.092606 -2.144349 -2.131904
H  -5.066975 3.376444 -1.723699
H  -3.749191 3.609727 -0.558909
H  -5.436047 3.897066 -0.068602
H  -5.621057 0.359692 3.595504
H  -5.077264 2.034553 3.855705
H  -6.808042 1.673239 3.699032
H  7.188848 0.238091 -1.873482
H  6.75007 1.734505 -2.72987
H  7.958965 1.773821 -1.432374
H  2.511492 3.236068 -0.795007
H  2.807862 3.56434 0.923453
H  4.052475 3.959308 -0.276621
elementType: S P O C H
totalener: -2950.72130143 hartree
nucrepener: 3366.17927133 hartree
electener: -6316.90057276 hartree
twoeener: 4447.66750178 hartree
cpcmener: -0.03510935 hartree
kineticenergy: 2942.57383678 hartree
xcener: -192.749659664488 hartree
chargesum: -0.0000000
charge: -0.066662 -0.450158 -0.455444 0.770728 0.779416 -0.341951 -0.358580 -0.345167 -0.345134 -0.344955 -0.345849 0.038176 0.037321 0.236589 0.248567 -0.126386 -0.144312 -0.138522 -0.139457 -0.170697 -0.178003 -0.181562 -0.191550 -0.115610 -0.116246 -0.113182 -0.116602 0.147565 0.150598 0.137213 0.137277 0.154432 0.156594 0.154648 0.149952 0.131039 0.111736 0.130098 0.127515 0.111161 0.131440 0.128526 0.111495 0.131424 0.113658 0.129646 0.129213
qa: -0.0667 -0.4502 -0.4554 0.7707 0.7794 -0.3420 -0.3586 -0.3452 -0.3451 -0.3450 -0.3458 0.0382 0.0373 0.2366 0.2486 -0.1264 -0.1443 -0.1385 -0.1395 -0.1707 -0.1780 -0.1816 -0.1915 -0.1156 -0.1162 -0.1132 -0.1166 0.1476 0.1506 0.1372 0.1373 0.1544 0.1566 0.1546 0.1500 0.1310 0.1117 0.1301 0.1275 0.1112 0.1314 0.1285 0.1115 0.1314 0.1137 0.1296 0.1292
va: 2.2962 1.9825 1.9836 5.4731 5.4789 2.1120 2.0972 2.0937 2.1010 2.0970 2.1061 3.6997 3.7439 3.7206 3.7016 3.9556 3.9192 3.9754 3.9627 3.9665 4.0318 4.0226 4.0316 3.8348 3.8428 3.8336 3.8418 0.9970 0.9922 1.0132 1.0128 1.0067 1.0050 0.9969 1.0033 0.9902 1.0002 0.9883 0.9846 0.9999 0.9906 0.9855 1.0009 0.9907 0.9992 0.9910 0.9861
dispcorr: -0.023613461 hartree
energy: -2950.744914889860
dipole: -1.02740 0.58972 -0.43768 10.78514 -9.49300 1.29214 2.28310 -1.63150 0.65160
magnitude: 1.51188 au
magnitude: 3.84289 debye
