program: Orca
programVersion: 5.0.2
elementType: S S S P P O O O O O O C C C C C C C C C C C C C C C C H H H H H H H H H H H H H H H H H H H H
charge: 0
multiplicity: 1
keywords: wb97x-d3
keywords: def2-TZVPP
keywords: def2/J RIJCOSX
keywords: DEFGRID2
keywords: scfconv7
keywords: smallprint printgap noloewdin
keywords: NOSOSCF
formula: C16H20O6P2S3
InChI: InChI=1/C16H20O6P2S3/c1-17-23(25,18-2)21-13-5-9-15(10-6-13)27-16-11-7-14(8-12-16)22-24(26,19-3)20-4/h5-12H,1-4H3
47 atoms
S  -0.124793 -3.946517 -0.450548
S  -2.71569 1.883639 1.921567
S  3.664204 1.294499 -2.726744
P  -4.371679 1.33798 1.129854
P  4.432529 1.187603 -0.974797
O  -4.5499 -0.249353 0.868653
O  4.530633 -0.290832 -0.322419
O  -4.730806 1.905389 -0.313523
O  -5.705736 1.653148 1.93907
O  5.940314 1.668602 -0.806808
O  3.693755 1.977301 0.194079
C  -1.444127 -2.825831 -0.067167
C  1.258434 -2.837559 -0.396794
C  -3.502121 -1.085008 0.544142
C  3.437637 -1.139735 -0.34657
C  -1.723067 -1.75117 -0.907006
C  1.41933 -1.93863 0.65406
C  -2.21716 -3.033376 1.067711
C  2.212084 -2.897868 -1.406164
C  -2.746796 -0.872294 -0.600745
C  2.501662 -1.076338 0.674349
C  -3.251584 -2.161238 1.376746
C  3.309898 -2.049492 -1.380732
C  -4.538845 3.291104 -0.627932
C  -5.771531 1.437698 3.354806
C  6.921092 1.37864 -1.811981
C  3.102663 3.263007 -0.040018
H  -1.136188 -1.591217 -1.801966
H  0.694686 -1.89658 1.456826
H  -2.003942 -3.862543 1.728953
H  2.095015 -3.590302 -2.229512
H  -2.961575 -0.04399 -1.263006
H  2.622027 -0.37439 1.488797
H  -3.848628 -2.312792 2.266419
H  4.049481 -2.088975 -2.169187
H  -3.4924 3.573752 -0.518884
H  -5.157528 3.927954 0.003598
H  -4.839006 3.416063 -1.664402
H  -6.778351 1.706391 3.661726
H  -5.588366 0.392616 3.605013
H  -5.05371 2.068393 3.878022
H  7.855191 1.81103 -1.465145
H  7.049036 0.304207 -1.940701
H  6.646673 1.829397 -2.764858
H  2.663025 3.575431 0.902969
H  3.851996 3.992476 -0.34562
H  2.323359 3.200753 -0.798372
elementType: S P O C H
totalener: -2950.72118843 hartree
nucrepener: 3379.07302313 hartree
electener: -6329.79421157 hartree
twoeener: 4460.56201270 hartree
cpcmener: -0.03509081 hartree
kineticenergy: 2942.57325161 hartree
xcener: -192.748962564933 hartree
chargesum: -0.0000000
charge: -0.069674 -0.450351 -0.454760 0.770809 0.779518 -0.342277 -0.358873 -0.344580 -0.345750 -0.344923 -0.346727 0.041791 0.038446 0.233966 0.250274 -0.124820 -0.144642 -0.139684 -0.139627 -0.172365 -0.177797 -0.181900 -0.191258 -0.116686 -0.116001 -0.113452 -0.116700 0.146575 0.149739 0.137375 0.137330 0.157086 0.156046 0.154996 0.149808 0.113064 0.129576 0.131284 0.131395 0.127170 0.112065 0.131435 0.127782 0.112209 0.129784 0.129197 0.114128
qa: -0.0697 -0.4504 -0.4548 0.7708 0.7795 -0.3423 -0.3589 -0.3446 -0.3457 -0.3449 -0.3467 0.0418 0.0384 0.2340 0.2503 -0.1248 -0.1446 -0.1397 -0.1396 -0.1724 -0.1778 -0.1819 -0.1913 -0.1167 -0.1160 -0.1135 -0.1167 0.1466 0.1497 0.1374 0.1373 0.1571 0.1560 0.1550 0.1498 0.1131 0.1296 0.1313 0.1314 0.1272 0.1121 0.1314 0.1278 0.1122 0.1298 0.1292 0.1141
va: 2.2871 1.9822 1.9835 5.4722 5.4773 2.1112 2.0962 2.0956 2.0991 2.0958 2.1050 3.6929 3.7426 3.7193 3.6990 3.9562 3.9193 3.9726 3.9643 3.9745 4.0352 4.0249 4.0291 3.8360 3.8419 3.8353 3.8414 0.9976 0.9925 1.0130 1.0128 1.0062 1.0050 0.9965 1.0035 0.9992 0.9881 0.9906 0.9909 0.9847 0.9996 0.9910 0.9855 1.0001 0.9912 0.9862 0.9991
dispcorr: -0.023776710 hartree
energy: -2950.744965144032
dipole: -1.10009 0.64153 -0.45857 10.93829 -9.61225 1.32604 2.09622 -1.50060 0.59562
magnitude: 1.52428 au
magnitude: 3.87440 debye
