program: Orca
programVersion: 5.0.2
elementType: S S S P P O O O O O O C C C C C C C C C C C C C C C C H H H H H H H H H H H H H H H H H H H H
charge: 0
multiplicity: 1
keywords: wb97x-d3
keywords: def2-TZVPP
keywords: def2/J RIJCOSX
keywords: DEFGRID2
keywords: scfconv7
keywords: smallprint printgap noloewdin
keywords: NOSOSCF
formula: C16H20O6P2S3
InChI: InChI=1/C16H20O6P2S3/c1-17-23(25,18-2)21-13-5-9-15(10-6-13)27-16-11-7-14(8-12-16)22-24(26,19-3)20-4/h5-12H,1-4H3
47 atoms
S  0.127636 -2.549641 0.823651
S  -6.699276 -1.246687 0.148355
S  6.469125 -0.127289 1.156928
P  -6.109352 0.574826 0.104288
P  6.108225 0.783816 -0.489106
O  -4.578273 0.823875 -0.347337
O  4.546717 1.017744 -0.83942
O  -6.14153 1.400947 1.463666
O  -6.858194 1.561767 -0.895835
O  6.675457 2.263317 -0.646152
O  6.603145 0.110233 -1.842526
C  -1.294026 -1.553435 0.478982
C  1.42834 -1.462256 0.3104
C  -3.523508 -0.003547 -0.038426
C  3.540569 0.159466 -0.447088
C  -2.145037 -1.18799 1.513314
C  2.496137 -1.991454 -0.404627
C  -1.576848 -1.150951 -0.823494
C  1.428347 -0.111287 0.646453
C  -3.269406 -0.41504 1.259348
C  3.560082 -1.184401 -0.78083
C  -2.689477 -0.37234 -1.08376
C  2.481554 0.701312 0.264118
C  -7.28195 1.340751 2.331251
C  -7.300062 1.112444 -2.184132
C  6.597402 3.193279 0.441871
C  7.914063 -0.463309 -1.945498
H  -1.929006 -1.488941 2.52975
H  2.501948 -3.036381 -0.685969
H  -0.928416 -1.440963 -1.63985
H  0.609827 0.3170 1.210228
H  -3.906615 -0.117639 2.081381
H  4.373973 -1.609456 -1.353499
H  -2.909955 -0.051439 -2.093484
H  2.482367 1.751731 0.524807
H  -7.450984 0.322837 2.680845
H  -8.177239 1.70919 1.83108
H  -7.057069 1.980641 3.179676
H  -6.469929 0.732616 -2.779585
H  -8.06097 0.339222 -2.08542
H  -7.728231 1.978057 -2.681495
H  5.566147 3.345395 0.760551
H  7.19275 2.851143 1.28763
H  6.999396 4.133166 0.074453
H  8.057355 -1.245324 -1.200523
H  7.983316 -0.896742 -2.939154
H  8.685374 0.29741 -1.829907
elementType: S P O C H
totalener: -2950.72133739 hartree
nucrepener: 3233.58353798 hartree
electener: -6184.30487537 hartree
twoeener: 4314.71585877 hartree
cpcmener: -0.03694498 hartree
kineticenergy: 2942.58642867 hartree
xcener: -192.753451821351 hartree
chargesum: 0.0000000
charge: -0.066554 -0.449544 -0.452645 0.765799 0.771606 -0.333337 -0.342936 -0.344217 -0.347449 -0.346211 -0.345454 0.042508 0.041060 0.234067 0.218828 -0.157383 -0.158743 -0.118966 -0.140614 -0.159017 -0.157944 -0.185592 -0.184699 -0.116694 -0.115603 -0.116382 -0.116209 0.137798 0.136516 0.148035 0.154513 0.153690 0.153035 0.153858 0.154665 0.112793 0.130394 0.131555 0.126867 0.113661 0.131256 0.126258 0.112430 0.131412 0.111831 0.131267 0.130490
qa: -0.0666 -0.4495 -0.4526 0.7658 0.7716 -0.3333 -0.3429 -0.3442 -0.3474 -0.3462 -0.3455 0.0425 0.0411 0.2341 0.2188 -0.1574 -0.1587 -0.1190 -0.1406 -0.1590 -0.1579 -0.1856 -0.1847 -0.1167 -0.1156 -0.1164 -0.1162 0.1378 0.1365 0.1480 0.1545 0.1537 0.1530 0.1539 0.1547 0.1128 0.1304 0.1316 0.1269 0.1137 0.1313 0.1263 0.1124 0.1314 0.1118 0.1313 0.1305
va: 2.2959 1.9820 1.9788 5.4755 5.4718 2.1232 2.1106 2.0917 2.0947 2.0978 2.0928 3.6967 3.7451 3.7421 3.7379 4.0200 3.9984 3.9315 3.9076 3.9681 3.9715 4.0021 4.0086 3.8350 3.8393 3.8444 3.8351 1.0149 1.0145 0.9956 0.9885 1.0079 1.0062 0.9988 0.9981 0.9995 0.9886 0.9907 0.9852 0.9990 0.9917 0.9847 0.9991 0.9914 0.9998 0.9904 0.9882
dispcorr: -0.023079354 hartree
energy: -2950.744416748718
dipole: -0.32519 0.12469 -0.20050 8.25326 -6.33918 1.91407 -2.62282 1.82184 -0.80097
magnitude: 2.08457 au
magnitude: 5.29856 debye
