program: Orca
programVersion: 5.0.2
elementType: S S S P P O O O O O O C C C C C C C C C C C C C C C C H H H H H H H H H H H H H H H H H H H H
charge: 0
multiplicity: 1
keywords: wb97x-d3
keywords: def2-TZVPP
keywords: def2/J RIJCOSX
keywords: DEFGRID2
keywords: scfconv7
keywords: smallprint printgap noloewdin
keywords: NOSOSCF
formula: C16H20O6P2S3
InChI: InChI=1/C16H20O6P2S3/c1-17-23(25,18-2)21-13-5-9-15(10-6-13)27-16-11-7-14(8-12-16)22-24(26,19-3)20-4/h5-12H,1-4H3
47 atoms
S  -0.134271 -2.567144 -0.270326
S  -7.165501 2.359105 1.187064
S  5.527287 0.844374 -2.705409
P  -5.978761 0.864909 1.050075
P  6.018187 0.49403 -0.885893
O  -4.616763 1.257573 0.274663
O  4.837359 0.602102 0.215431
O  -6.5473 -0.435407 0.31863
O  -5.387918 0.22932 2.383196
O  6.598551 -0.949167 -0.551108
O  7.103389 1.45673 -0.232101
C  -1.437763 -1.381362 -0.112457
C  1.316596 -1.566652 -0.111268
C  -3.572049 0.352766 0.150146
C  3.670448 -0.130865 0.08348
C  -1.447176 -0.437648 0.911711
C  2.375384 -2.060532 0.64249
C  -2.501976 -1.444356 -1.003488
C  1.444624 -0.344149 -0.765633
C  -2.510461 0.437672 1.038383
C  3.563666 -1.349873 0.729229
C  -3.581956 -0.583067 -0.867893
C  2.617385 0.383394 -0.657718
C  -7.35428 -0.33092 -0.860241
C  -6.25023 -0.176326 3.454392
C  7.552141 -1.582328 -1.414806
C  7.059647 2.874324 -0.443134
H  -0.627213 -0.381867 1.615671
H  2.279919 -3.000361 1.170501
H  -2.495395 -2.162485 -1.813015
H  0.630871 0.049849 -1.360218
H  -2.516069 1.177982 1.827684
H  4.385289 -1.733884 1.319262
H  -4.402674 -0.628591 -1.571795
H  2.71274 1.340164 -1.152952
H  -6.807566 0.145446 -1.67423
H  -8.265913 0.230867 -0.657353
H  -7.612515 -1.345988 -1.149976
H  -6.890735 -1.003909 3.150944
H  -5.605213 -0.501284 4.265829
H  -6.86602 0.655796 3.795702
H  7.143747 -1.714849 -2.416121
H  8.475018 -1.005677 -1.469503
H  7.762966 -2.555303 -0.979825
H  7.930696 3.288605 0.056905
H  7.105911 3.112629 -1.505463
H  6.157513 3.307192 -0.011109
elementType: S P O C H
totalener: -2950.72114893 hartree
nucrepener: 3245.08996001 hartree
electener: -6195.81110894 hartree
twoeener: 4325.86988916 hartree
cpcmener: -0.03708052 hartree
kineticenergy: 2942.56530686 hartree
xcener: -192.748141021184 hartree
chargesum: -0.0000000
charge: -0.042053 -0.437948 -0.453894 0.727338 0.774573 -0.354760 -0.358635 -0.337709 -0.325157 -0.342710 -0.342954 0.040414 0.029345 0.247729 0.266309 -0.138262 -0.139812 -0.159032 -0.135596 -0.193390 -0.189901 -0.172577 -0.200229 -0.113788 -0.112801 -0.115850 -0.111862 0.157860 0.137806 0.138060 0.157462 0.153045 0.154122 0.165704 0.148420 0.125476 0.118011 0.133329 0.126601 0.127743 0.108796 0.113167 0.128223 0.129554 0.131145 0.110275 0.128415
qa: -0.0421 -0.4379 -0.4539 0.7273 0.7746 -0.3548 -0.3586 -0.3377 -0.3252 -0.3427 -0.3430 0.0404 0.0293 0.2477 0.2663 -0.1383 -0.1398 -0.1590 -0.1356 -0.1934 -0.1899 -0.1726 -0.2002 -0.1138 -0.1128 -0.1159 -0.1119 0.1579 0.1378 0.1381 0.1575 0.1530 0.1541 0.1657 0.1484 0.1255 0.1180 0.1333 0.1266 0.1277 0.1088 0.1132 0.1282 0.1296 0.1311 0.1103 0.1284
va: 2.3559 2.0213 1.9881 5.5160 5.4902 2.1046 2.0986 2.0578 2.0975 2.1116 2.0966 3.7365 3.7551 3.7304 3.6934 3.9115 3.9692 4.0026 3.9136 4.0120 4.0640 4.0267 4.0227 3.8224 3.8427 3.8424 3.8332 0.9879 1.0121 1.0142 0.9879 1.0012 1.0038 0.9853 1.0094 0.9842 1.0054 0.9897 0.9883 0.9893 0.9991 0.9994 0.9861 0.9904 0.9904 1.0010 0.9858
dispcorr: -0.023340650 hartree
energy: -2950.744489582349
dipole: 2.74894 -1.96090 0.78804 -3.98210 2.70121 -1.28089 1.40114 -0.90868 0.49247
magnitude: 1.58247 au
magnitude: 4.02232 debye
