program: Orca
programVersion: 5.0.2
elementType: S S S P P O O O O O O C C C C C C C C C C C C C C C C H H H H H H H H H H H H H H H H H H H H
charge: 0
multiplicity: 1
keywords: wb97x-d3
keywords: def2-TZVPP
keywords: def2/J RIJCOSX
keywords: DEFGRID2
keywords: scfconv7
keywords: smallprint printgap noloewdin
keywords: NOSOSCF
formula: C16H20O6P2S3
InChI: InChI=1/C16H20O6P2S3/c1-17-23(25,18-2)21-13-5-9-15(10-6-13)27-16-11-7-14(8-12-16)22-24(26,19-3)20-4/h5-12H,1-4H3
47 atoms
S  -0.041645 -2.554048 -0.443342
S  -6.681072 -0.778741 -0.718757
S  6.768457 -1.137484 0.18898
P  -6.212027 0.634934 0.485173
P  6.199084 0.634935 -0.257179
O  -4.645294 1.017071 0.574308
O  4.662329 0.999994 0.098444
O  -6.541909 0.43057 2.029138
O  -6.849865 2.06933 0.216215
O  6.952177 1.847447 0.447011
O  6.242492 1.075201 -1.786852
C  -1.404761 -1.465959 -0.127298
C  1.342469 -1.456835 -0.293906
C  -3.602793 0.148745 0.336891
C  3.591745 0.147322 -0.061148
C  -2.355575 -1.832848 0.817326
C  1.545355 -0.698509 0.856118
C  -1.567189 -0.284292 -0.845398
C  2.27464 -1.402575 -1.321999
C  -3.464036 -1.030066 1.049073
C  2.665234 0.105898 0.971745
C  -2.663291 0.527044 -0.61048
C  3.405858 -0.605784 -1.209167
C  -7.847775 0.004219 2.441436
C  -6.881284 2.617583 -1.107953
C  7.37435 1.764497 1.814854
C  7.387203 0.794903 -2.605211
H  -2.234404 -2.743098 1.389423
H  0.832546 -0.735282 1.669807
H  -0.840668 0.006805 -1.592913
H  2.122498 -1.975227 -2.227299
H  -4.187536 -1.316383 1.801273
H  2.822863 0.695086 1.865652
H  -2.79148 1.447229 -1.165494
H  4.105431 -0.565058 -2.033112
H  -8.608867 0.726811 2.14812
H  -7.82219 -0.066744 3.525004
H  -8.089805 -0.971444 2.02101
H  -7.515447 2.019582 -1.761369
H  -7.296928 3.617282 -1.018943
H  -5.880077 2.68457 -1.53382
H  6.533271 1.568929 2.479145
H  8.128115 0.988876 1.941018
H  7.806177 2.730413 2.06057
H  8.283776 1.265746 -2.204081
H  7.545677 -0.278825 -2.696442
H  7.172577 1.211775 -3.585132
elementType: S P O C H
totalener: -2950.72134692 hartree
nucrepener: 3220.21558416 hartree
electener: -6170.93693109 hartree
twoeener: 4301.32850888 hartree
cpcmener: -0.03693805 hartree
kineticenergy: 2942.54990329 hartree
xcener: -192.746586848699 hartree
chargesum: 0.0000000
charge: -0.067699 -0.450091 -0.447023 0.766348 0.762946 -0.339113 -0.331464 -0.344432 -0.345458 -0.346588 -0.345494 0.036795 0.031576 0.229119 0.232511 -0.152472 -0.119145 -0.126766 -0.159907 -0.159237 -0.190939 -0.185533 -0.159810 -0.116988 -0.115675 -0.114811 -0.117335 0.137035 0.150823 0.150585 0.137599 0.150750 0.153129 0.155864 0.151167 0.128344 0.131226 0.112046 0.111704 0.131551 0.125899 0.126734 0.113893 0.131402 0.131131 0.113807 0.131993
qa: -0.0677 -0.4501 -0.4470 0.7663 0.7629 -0.3391 -0.3315 -0.3444 -0.3455 -0.3466 -0.3455 0.0368 0.0316 0.2291 0.2325 -0.1525 -0.1191 -0.1268 -0.1599 -0.1592 -0.1909 -0.1855 -0.1598 -0.1170 -0.1157 -0.1148 -0.1173 0.1370 0.1508 0.1506 0.1376 0.1507 0.1531 0.1559 0.1512 0.1283 0.1312 0.1120 0.1117 0.1316 0.1259 0.1267 0.1139 0.1314 0.1311 0.1138 0.1320
va: 2.2921 1.9826 1.9853 5.4772 5.4768 2.1139 2.1261 2.0936 2.0967 2.0970 2.0879 3.7242 3.7270 3.7324 3.7507 4.0017 3.9182 3.9220 4.0186 3.9816 3.9985 4.0058 3.9598 3.8385 3.8462 3.8380 3.8332 1.0151 0.9919 0.9923 1.0157 1.0086 1.0004 0.9969 1.0091 0.9887 0.9901 0.9990 0.9989 0.9912 0.9842 0.9856 0.9988 0.9916 0.9888 0.9989 0.9905
dispcorr: -0.022937022 hartree
energy: -2950.744283947291
dipole: 0.23813 -0.10410 0.13403 9.01839 -6.81781 2.20058 0.73717 -0.46074 0.27643
magnitude: 2.22192 au
magnitude: 5.64766 debye
