program: Orca
programVersion: 5.0.2
elementType: S S S P P O O O O O O C C C C C C C C C C C C C C C C H H H H H H H H H H H H H H H H H H H H
charge: 0
multiplicity: 1
keywords: wb97x-d3
keywords: def2-TZVPP
keywords: def2/J RIJCOSX
keywords: DEFGRID2
keywords: scfconv7
keywords: smallprint printgap noloewdin
keywords: NOSOSCF
formula: C16H20O6P2S3
InChI: InChI=1/C16H20O6P2S3/c1-17-23(25,18-2)21-13-5-9-15(10-6-13)27-16-11-7-14(8-12-16)22-24(26,19-3)20-4/h5-12H,1-4H3
47 atoms
S  -0.065792 -3.655579 -0.120985
S  -4.773594 1.065572 -2.25091
S  5.252937 0.520846 2.30476
P  -4.840792 1.368062 -0.359957
P  5.034045 0.930005 0.44455
O  -4.598285 0.077514 0.584481
O  4.808969 -0.330953 -0.546706
O  -6.208736 1.90541 0.248908
O  -3.786203 2.394655 0.246201
O  3.864276 1.95276 0.088548
O  6.277829 1.522303 -0.346996
C  -1.377235 -2.48257 0.068723
C  1.361653 -2.61617 -0.239228
C  -3.51729 -0.763654 0.393191
C  3.655985 -1.089183 -0.43541
C  -2.588662 -2.748421 -0.560311
C  1.40362 -1.529537 -1.10992
C  -1.249368 -1.35333 0.873164
C  2.483507 -2.94249 0.513268
C  -3.66686 -1.892042 -0.392635
C  2.546257 -0.753677 -1.198592
C  -2.314924 -0.482863 1.024098
C  3.63956 -2.181976 0.411973
C  -7.464699 1.312288 -0.104618
C  -3.432419 3.597664 -0.449571
C  2.715352 2.196333 0.90816
C  6.979162 2.662692 0.166699
H  -2.697008 -3.618167 -1.195326
H  0.543676 -1.27702 -1.716531
H  -0.318831 -1.141753 1.383387
H  2.460422 -3.783011 1.19431
H  -4.611083 -2.101415 -0.877073
H  2.57752 0.094568 -1.870089
H  -2.214241 0.393443 1.650695
H  4.514568 -2.437909 0.993778
H  -7.590739 1.272716 -1.186538
H  -8.238852 1.942951 0.323663
H  -7.549699 0.307725 0.309213
H  -2.649051 4.072205 0.134552
H  -3.055106 3.3764 -1.44728
H  -4.285247 4.271794 -0.523175
H  2.951288 2.09302 1.966659
H  2.395402 3.216188 0.710404
H  1.914133 1.506948 0.645704
H  7.792166 2.862856 -0.525278
H  6.328341 3.535686 0.216025
H  7.389446 2.457957 1.155279
elementType: S P O C H
totalener: -2950.71982184 hartree
nucrepener: 3349.94655962 hartree
electener: -6300.66638146 hartree
twoeener: 4430.12707835 hartree
cpcmener: -0.03511365 hartree
kineticenergy: 2942.56767985 hartree
xcener: -192.750776988941 hartree
chargesum: 0.0000000
charge: -0.038696 -0.454633 -0.451767 0.774503 0.757361 -0.357754 -0.353237 -0.342573 -0.345078 -0.341142 -0.340682 0.032362 0.034504 0.252803 0.262787 -0.133381 -0.129247 -0.148704 -0.133801 -0.195841 -0.211063 -0.182844 -0.188033 -0.108407 -0.115775 -0.084677 -0.120568 0.138397 0.156189 0.156484 0.137847 0.149909 0.158815 0.155562 0.147959 0.105586 0.131015 0.128185 0.129392 0.113045 0.129671 0.107913 0.129864 0.116430 0.131636 0.127763 0.111922
qa: -0.0387 -0.4546 -0.4518 0.7745 0.7574 -0.3578 -0.3532 -0.3426 -0.3451 -0.3411 -0.3407 0.0324 0.0345 0.2528 0.2628 -0.1334 -0.1292 -0.1487 -0.1338 -0.1958 -0.2111 -0.1828 -0.1880 -0.1084 -0.1158 -0.0847 -0.1206 0.1384 0.1562 0.1565 0.1378 0.1499 0.1588 0.1556 0.1480 0.1056 0.1310 0.1282 0.1294 0.1130 0.1297 0.1079 0.1299 0.1164 0.1316 0.1278 0.1119
va: 2.3647 1.9875 1.9915 5.4909 5.5095 2.0968 2.1020 2.1018 2.1072 2.0779 2.1154 3.7578 3.7365 3.7004 3.6763 3.9562 3.8928 3.9200 3.9813 4.0427 3.9676 4.0379 4.0488 3.8343 3.8392 3.8186 3.8423 1.0114 0.9897 0.9891 1.0126 1.0041 0.9994 1.0056 1.0072 1.0024 0.9893 0.9873 0.9905 1.0000 0.9857 1.0102 0.9905 0.9818 0.9902 0.9865 0.9991
dispcorr: -0.024197277 hartree
energy: -2950.744019119800
dipole: -4.64199 3.58230 -1.05970 13.76565 -11.62648 2.13917 1.02099 -0.81674 0.20424
magnitude: 2.39598 au
magnitude: 6.09009 debye
