program: Orca
programVersion: 5.0.2
elementType: S S S P P O O O O O O C C C C C C C C C C C C C C C C H H H H H H H H H H H H H H H H H H H H
charge: 0
multiplicity: 1
keywords: wb97x-d3
keywords: def2-TZVPP
keywords: def2/J RIJCOSX
keywords: DEFGRID2
keywords: scfconv7
keywords: smallprint printgap noloewdin
keywords: NOSOSCF
formula: C16H20O6P2S3
InChI: InChI=1/C16H20O6P2S3/c1-17-23(25,18-2)21-13-5-9-15(10-6-13)27-16-11-7-14(8-12-16)22-24(26,19-3)20-4/h5-12H,1-4H3
47 atoms
S  0.112276 -3.186835 0.668328
S  -4.700054 1.678007 2.754608
S  3.921752 2.307581 -1.348602
P  -5.405858 0.990466 1.114333
P  5.336101 1.036498 -1.115911
O  -4.357172 0.618856 -0.05764
O  4.963821 -0.512607 -1.395566
O  -6.330348 2.037474 0.358866
O  -6.217961 -0.383157 1.207629
O  6.622364 1.186789 -2.04143
O  5.98644 0.928518 0.332862
C  -1.189874 -2.010957 0.431105
C  1.526253 -2.314897 0.055886
C  -3.314303 -0.266363 0.140198
C  3.809664 -1.084936 -0.894261
C  -2.427386 -2.480972 0.004947
C  2.651182 -2.212928 0.864658
C  -1.024235 -0.657342 0.712075
C  1.553433 -1.799048 -1.237808
C  -3.499091 -1.610883 -0.129761
C  3.802853 -1.60226 0.388652
C  -2.084933 0.219406 0.55803
C  2.690582 -1.166879 -1.70994
C  -6.914097 1.764234 -0.927092
C  -7.112914 -0.630551 2.299943
C  6.496774 1.484504 -3.438621
C  6.250709 2.10393 1.111907
H  -2.563048 -3.527879 -0.233387
H  2.635652 -2.604697 1.872895
H  -0.069189 -0.277178 1.050358
H  0.686828 -1.884103 -1.880383
H  -4.457188 -1.977855 -0.472743
H  4.682027 -1.53611 1.015349
H  -1.95434 1.273913 0.761583
H  2.716191 -0.762966 -2.71329
H  -6.173005 1.881654 -1.715971
H  -7.705522 2.495018 -1.06826
H  -7.344249 0.764517 -0.973895
H  -6.575753 -0.636433 3.247568
H  -7.908015 0.114114 2.336837
H  -7.549542 -1.609909 2.125724
H  7.507057 1.562172 -3.830272
H  5.968294 0.689696 -3.964487
H  5.977656 2.430173 -3.591463
H  6.67959 1.761738 2.049277
H  6.962265 2.758113 0.60906
H  5.330829 2.651386 1.313627
elementType: S P O C H
totalener: -2950.72182562 hartree
nucrepener: 3282.96629563 hartree
electener: -6233.68812125 hartree
twoeener: 4364.31550466 hartree
cpcmener: -0.03725568 hartree
kineticenergy: 2942.55836941 hartree
xcener: -192.746475132612 hartree
chargesum: 0.0000000
charge: -0.050566 -0.437630 -0.453563 0.734745 0.776604 -0.354828 -0.355741 -0.342592 -0.335993 -0.343738 -0.345328 0.027560 0.030167 0.260921 0.254247 -0.142972 -0.142416 -0.124660 -0.120956 -0.180652 -0.172480 -0.208876 -0.200519 -0.109797 -0.111388 -0.112498 -0.117430 0.137263 0.137303 0.153813 0.153966 0.153546 0.156653 0.149968 0.153255 0.120021 0.128459 0.121666 0.115007 0.128189 0.129041 0.131335 0.127980 0.110243 0.130008 0.129231 0.113429
qa: -0.0506 -0.4376 -0.4536 0.7347 0.7766 -0.3548 -0.3557 -0.3426 -0.3360 -0.3437 -0.3453 0.0276 0.0302 0.2609 0.2542 -0.1430 -0.1424 -0.1247 -0.1210 -0.1807 -0.1725 -0.2089 -0.2005 -0.1098 -0.1114 -0.1125 -0.1174 0.1373 0.1373 0.1538 0.1540 0.1535 0.1567 0.1500 0.1533 0.1200 0.1285 0.1217 0.1150 0.1282 0.1290 0.1313 0.1280 0.1102 0.1300 0.1292 0.1134
va: 2.3367 2.0240 1.9850 5.5170 5.4824 2.0823 2.0993 2.0981 2.0591 2.0978 2.1073 3.7614 3.7242 3.6866 3.7024 3.9663 3.9923 3.9005 3.9157 4.0594 4.0525 4.0419 4.0170 3.8422 3.8332 3.8375 3.8417 1.0123 1.0140 0.9898 0.9915 1.0038 1.0046 1.0070 1.0015 0.9911 0.9894 0.9926 1.0012 0.9856 0.9915 0.9908 0.9856 1.0004 0.9908 0.9859 0.9990
dispcorr: -0.023451328 hartree
energy: -2950.745276948103
dipole: -2.81499 2.47836 -0.33663 1.32532 -2.02178 -0.69646 -4.45995 2.99241 -1.46754
magnitude: 1.65893 au
magnitude: 4.21667 debye
