program: Orca
programVersion: 5.0.2
elementType: S S S P P O O O O O O C C C C C C C C C C C C C C C C H H H H H H H H H H H H H H H H H H H H
charge: 0
multiplicity: 1
keywords: wb97x-d3
keywords: def2-TZVPP
keywords: def2/J RIJCOSX
keywords: DEFGRID2
keywords: scfconv7
keywords: smallprint printgap noloewdin
keywords: NOSOSCF
formula: C16H20O6P2S3
InChI: InChI=1/C16H20O6P2S3/c1-17-23(25,18-2)21-13-5-9-15(10-6-13)27-16-11-7-14(8-12-16)22-24(26,19-3)20-4/h5-12H,1-4H3
47 atoms
S  -0.026155 -3.194272 -0.242256
S  -4.290202 2.167016 2.283827
S  4.450003 1.554575 -2.434679
P  -5.440241 1.115489 1.17896
P  5.563751 0.812935 -1.062733
O  -4.766853 0.317677 -0.056354
O  4.798686 0.208497 0.225898
O  -6.511376 1.995787 0.408829
O  -6.225688 -0.085876 1.880466
O  6.492828 -0.418125 -1.455327
O  6.603457 1.78921 -0.355199
C  -1.410427 -2.099625 -0.155149
C  1.36466 -2.109689 -0.10098
C  -3.650987 -0.47691 -0.022122
C  3.656589 -0.563836 0.092129
C  -1.892237 -1.478748 -1.303944
C  1.266812 -0.73465 0.081199
C  -2.061213 -1.90074 1.05557
C  2.624035 -2.703438 -0.175441
C  -3.004835 -0.659672 -1.237615
C  2.414811 0.039658 0.171695
C  -3.185399 -1.092239 1.131548
C  3.770838 -1.933516 -0.081716
C  -7.444131 1.446783 -0.538976
C  -6.801158 0.077975 3.183857
C  7.285705 -0.399151 -2.649475
C  6.208284 3.096794 0.078121
H  -1.399157 -1.630639 -2.254837
H  0.303016 -0.248793 0.14926
H  -1.69848 -2.383017 1.953319
H  2.720702 -3.773766 -0.310785
H  -3.380891 -0.172796 -2.12794
H  2.33555 1.109635 0.311725
H  -3.67844 -0.97263 2.08606
H  4.743455 -2.404881 -0.133759
H  -7.86632 0.503143 -0.195869
H  -6.962301 1.304434 -1.504768
H  -8.244634 2.174296 -0.640949
H  -7.273714 -0.868075 3.433147
H  -6.03222 0.304742 3.921323
H  -7.553977 0.866111 3.187535
H  7.741318 -1.381709 -2.734729
H  6.668139 -0.210543 -3.527242
H  8.068479 0.356043 -2.584431
H  5.410297 3.042736 0.818933
H  7.084815 3.550838 0.531976
H  5.881814 3.704834 -0.764984
elementType: S P O C H
totalener: -2950.72117728 hartree
nucrepener: 3266.09147243 hartree
electener: -6216.81264971 hartree
twoeener: 4347.35636068 hartree
cpcmener: -0.03776371 hartree
kineticenergy: 2942.55775644 hartree
xcener: -192.750606204740 hartree
chargesum: 0.0000000
charge: -0.056916 -0.429278 -0.455903 0.717398 0.774368 -0.311468 -0.360867 -0.343977 -0.335942 -0.343839 -0.343374 0.035730 0.080515 0.300372 0.224429 -0.113941 -0.166501 -0.139586 -0.172352 -0.206377 -0.203745 -0.177763 -0.163888 -0.111220 -0.108475 -0.114010 -0.112789 0.143895 0.145047 0.140083 0.134089 0.152647 0.150126 0.134030 0.156101 0.122737 0.120855 0.128908 0.131418 0.113784 0.130895 0.129445 0.109368 0.127299 0.126806 0.131244 0.110623
qa: -0.0569 -0.4293 -0.4559 0.7174 0.7744 -0.3115 -0.3609 -0.3440 -0.3359 -0.3438 -0.3434 0.0357 0.0805 0.3004 0.2244 -0.1139 -0.1665 -0.1396 -0.1724 -0.2064 -0.2037 -0.1778 -0.1639 -0.1112 -0.1085 -0.1140 -0.1128 0.1439 0.1450 0.1401 0.1341 0.1526 0.1501 0.1340 0.1561 0.1227 0.1209 0.1289 0.1314 0.1138 0.1309 0.1294 0.1094 0.1273 0.1268 0.1312 0.1106
va: 2.3526 2.0156 1.9837 5.5220 5.4911 2.1444 2.0934 2.1126 2.0457 2.1122 2.0969 3.7440 3.8313 3.7146 3.7132 3.9585 3.9097 4.0386 3.9483 3.9900 4.0499 3.9615 4.0453 3.8409 3.8194 3.8428 3.8397 1.0031 1.0013 1.0101 1.0077 1.0021 1.0034 1.0210 1.0036 0.9925 0.9904 0.9896 0.9912 1.0018 0.9883 0.9895 1.0007 0.9869 0.9859 0.9907 1.0002
dispcorr: -0.023256804 hartree
energy: -2950.744434081652
dipole: -3.07994 1.70644 -1.37349 0.92237 -1.52846 -0.60609 -0.27557 0.27941 0.00385
magnitude: 1.50128 au
magnitude: 3.81595 debye
