program: Orca
programVersion: 5.0.2
elementType: S S S P P O O O O O O C C C C C C C C C C C C C C C C H H H H H H H H H H H H H H H H H H H H
charge: 0
multiplicity: 1
keywords: wb97x-d3
keywords: def2-TZVPP
keywords: def2/J RIJCOSX
keywords: DEFGRID2
keywords: scfconv7
keywords: smallprint printgap noloewdin
keywords: NOSOSCF
formula: C16H20O6P2S3
InChI: InChI=1/C16H20O6P2S3/c1-17-23(25,18-2)21-13-5-9-15(10-6-13)27-16-11-7-14(8-12-16)22-24(26,19-3)20-4/h5-12H,1-4H3
47 atoms
S  0.043402 -3.005491 0.584387
S  -5.498524 0.963623 2.385526
S  6.513549 -0.998434 -0.715712
P  -5.721698 1.03467 0.484941
P  5.791418 0.773276 -0.642725
O  -5.064032 -0.173337 -0.361913
O  4.204355 0.908893 -0.928083
O  -5.119719 2.289753 -0.288134
O  -7.208698 0.995774 -0.079801
O  5.905334 1.561889 0.735353
O  6.361007 1.844052 -1.673435
C  -1.448111 -2.093757 0.305292
C  1.284934 -1.828588 0.134557
C  -3.855342 -0.774846 -0.087704
C  3.268052 -0.025761 -0.546494
C  -1.518813 -0.71048 0.42966
C  2.185834 -1.386813 1.094241
C  -2.599322 -2.81205 -0.005194
C  1.388605 -1.366773 -1.175064
C  -2.716242 -0.046012 0.219421
C  3.18582 -0.485846 0.757363
C  -3.805591 -2.155409 -0.185993
C  2.376672 -0.461046 -1.51677
C  -5.317782 3.6208 0.207965
C  -8.200485 0.142027 0.504849
C  7.12532 1.541788 1.490097
C  6.579506 1.496004 -3.047033
H  -0.639972 -0.131724 0.680681
H  2.10645 -1.732453 2.116272
H  -2.563875 -3.888755 -0.113359
H  0.698158 -1.712321 -1.933214
H  -2.73697 1.033486 0.287056
H  3.866301 -0.135297 1.521708
H  -4.698924 -2.71609 -0.428681
H  2.459925 -0.09751 -2.532675
H  -4.812077 4.286842 -0.485355
H  -4.883193 3.735925 1.200346
H  -6.376733 3.875917 0.241097
H  -8.378584 0.408868 1.545769
H  -9.112335 0.292149 -0.066322
H  -7.90698 -0.905701 0.441515
H  7.40021 0.522638 1.759244
H  7.939345 2.004401 0.933222
H  6.93853 2.114515 2.3939
H  5.655318 1.171122 -3.524848
H  6.938981 2.394723 -3.540013
H  7.330178 0.711254 -3.134214
elementType: S P O C H
totalener: -2950.72140967 hartree
nucrepener: 3250.97102336 hartree
electener: -6201.69243304 hartree
twoeener: 4332.04592061 hartree
cpcmener: -0.03652247 hartree
kineticenergy: 2942.57419704 hartree
xcener: -192.753254286730 hartree
chargesum: 0.0000000
charge: -0.051732 -0.449739 -0.448895 0.764044 0.767449 -0.331376 -0.335712 -0.345686 -0.346915 -0.345636 -0.345306 0.050270 0.051763 0.219012 0.230808 -0.175892 -0.145467 -0.150990 -0.144621 -0.163207 -0.164169 -0.181990 -0.172027 -0.115349 -0.115176 -0.115913 -0.116259 0.154120 0.138919 0.135962 0.151794 0.146560 0.153882 0.152722 0.155178 0.131876 0.112168 0.129771 0.112891 0.130866 0.126366 0.112244 0.131297 0.131110 0.127236 0.131580 0.112169
qa: -0.0517 -0.4497 -0.4489 0.7640 0.7674 -0.3314 -0.3357 -0.3457 -0.3469 -0.3456 -0.3453 0.0503 0.0518 0.2190 0.2308 -0.1759 -0.1455 -0.1510 -0.1446 -0.1632 -0.1642 -0.1820 -0.1720 -0.1153 -0.1152 -0.1159 -0.1163 0.1541 0.1389 0.1360 0.1518 0.1466 0.1539 0.1527 0.1552 0.1319 0.1122 0.1298 0.1129 0.1309 0.1264 0.1122 0.1313 0.1311 0.1272 0.1316 0.1122
va: 2.3415 1.9835 1.9837 5.4802 5.4760 2.1269 2.1205 2.0872 2.0977 2.0912 2.1005 3.7821 3.7101 3.7487 3.7552 3.9536 4.0222 3.9610 3.9515 3.9570 3.9667 4.0103 3.9886 3.8341 3.8402 3.8332 3.8418 0.9925 1.0143 1.0100 0.9952 1.0140 1.0075 0.9999 0.9978 0.9904 0.9999 0.9893 0.9994 0.9912 0.9856 0.9999 0.9884 0.9908 0.9850 0.9909 0.9991
dispcorr: -0.023008511 hartree
energy: -2950.744418183814
dipole: -0.67965 0.52744 -0.15221 9.10433 -7.39855 1.70577 -2.66039 1.73354 -0.92685
magnitude: 1.94727 au
magnitude: 4.94957 debye
