program: Orca
programVersion: 5.0.2
elementType: S S S P P O O O O O O C C C C C C C C C C C C C C C C H H H H H H H H H H H H H H H H H H H H
charge: 0
multiplicity: 1
keywords: wb97x-d3
keywords: def2-TZVPP
keywords: def2/J RIJCOSX
keywords: DEFGRID2
keywords: scfconv7
keywords: smallprint printgap noloewdin
keywords: NOSOSCF
formula: C16H20O6P2S3
InChI: InChI=1/C16H20O6P2S3/c1-17-23(25,18-2)21-13-5-9-15(10-6-13)27-16-11-7-14(8-12-16)22-24(26,19-3)20-4/h5-12H,1-4H3
47 atoms
S  -0.029585 -3.333984 0.419842
S  -6.645364 2.305837 -0.371122
S  3.813334 2.148013 -0.306835
P  -5.436984 1.014593 0.358964
P  5.318904 0.965319 -0.388665
O  -4.341594 0.555273 -0.733643
O  5.012778 -0.540719 -0.896852
O  -6.022088 -0.394201 0.814265
O  -4.615027 1.444014 1.659913
O  6.516512 1.367732 -1.35476
O  6.090836 0.655957 0.968734
C  -1.279995 -2.131812 0.066477
C  1.457664 -2.46157 0.020897
C  -3.331897 -0.34632 -0.429311
C  3.826957 -1.174095 -0.573325
C  -1.112492 -0.779307 0.351014
C  2.484348 -2.425548 0.956119
C  -2.48267 -2.579593 -0.470191
C  1.630646 -1.859027 -1.223184
C  -2.134728 0.117971 0.091841
C  3.68025 -1.78676 0.65812
C  -3.518334 -1.688639 -0.707569
C  2.809563 -1.197148 -1.515242
C  -7.126658 -0.462072 1.72617
C  -4.11826 2.780121 1.811283
C  6.271243 1.93641 -2.646876
C  6.425171 1.713888 1.878134
H  -0.184763 -0.413538 0.770898
H  2.354236 -2.883677 1.927822
H  -2.618483 -3.625279 -0.714285
H  0.841226 -1.890395 -1.96275
H  -1.993759 1.172257 0.29256
H  4.48058 -1.764199 1.386036
H  -4.449545 -2.038043 -1.133663
H  2.945065 -0.715363 -2.474683
H  -6.831695 -0.130474 2.720894
H  -7.432081 -1.503371 1.768977
H  -7.9624 0.142659 1.373585
H  -3.424968 3.043363 1.011873
H  -4.937927 3.49766 1.828838
H  -3.593056 2.810612 2.762163
H  7.245071 2.145721 -3.082257
H  5.73403 1.238279 -3.289902
H  5.705694 2.864514 -2.56297
H  7.125927 2.415309 1.424879
H  5.531589 2.248557 2.200667
H  6.894109 1.245398 2.739409
elementType: S P O C H
totalener: -2950.72188120 hartree
nucrepener: 3302.14174534 hartree
electener: -6252.86362653 hartree
twoeener: 4382.87037185 hartree
cpcmener: -0.03750046 hartree
kineticenergy: 2942.55903345 hartree
xcener: -192.746598328983 hartree
chargesum: -0.0000000
charge: -0.044445 -0.439601 -0.452958 0.727080 0.776675 -0.352211 -0.358280 -0.330525 -0.339706 -0.343990 -0.344326 0.043044 0.043859 0.243473 0.240179 -0.157946 -0.142834 -0.144122 -0.142791 -0.184607 -0.170422 -0.183879 -0.183523 -0.107582 -0.115105 -0.114537 -0.116442 0.151256 0.138533 0.137171 0.155019 0.166009 0.157733 0.152435 0.156019 0.125796 0.128008 0.106231 0.125919 0.119825 0.134748 0.131702 0.127770 0.111806 0.127896 0.111725 0.129921
qa: -0.0444 -0.4396 -0.4530 0.7271 0.7767 -0.3522 -0.3583 -0.3305 -0.3397 -0.3440 -0.3443 0.0430 0.0439 0.2435 0.2402 -0.1579 -0.1428 -0.1441 -0.1428 -0.1846 -0.1704 -0.1839 -0.1835 -0.1076 -0.1151 -0.1145 -0.1164 0.1513 0.1385 0.1372 0.1550 0.1660 0.1577 0.1524 0.1560 0.1258 0.1280 0.1062 0.1259 0.1198 0.1347 0.1317 0.1278 0.1118 0.1279 0.1117 0.1299
va: 2.3526 2.0168 1.9818 5.5165 5.4780 2.1096 2.0957 2.0980 2.0529 2.0984 2.1081 3.7591 3.7159 3.7311 3.7081 3.9351 3.9980 3.9615 3.9250 4.0101 4.0455 4.0395 4.0009 3.8393 3.8179 3.8386 3.8421 0.9943 1.0132 1.0114 0.9910 0.9863 1.0041 1.0019 0.9964 0.9892 0.9892 1.0013 0.9847 1.0055 0.9901 0.9909 0.9846 1.0000 0.9869 0.9994 0.9901
dispcorr: -0.023739546 hartree
energy: -2950.745620741286
dipole: 5.53394 -3.70537 1.82857 5.38897 -5.25167 0.13730 6.41109 -5.20626 1.20483
magnitude: 2.19411 au
magnitude: 5.57699 debye
