program: Orca
programVersion: 5.0.2
elementType: S S S P P O O O O O O C C C C C C C C C C C C C C C C H H H H H H H H H H H H H H H H H H H H
charge: 0
multiplicity: 1
keywords: wb97x-d3
keywords: def2-TZVPP
keywords: def2/J RIJCOSX
keywords: DEFGRID2
keywords: scfconv7
keywords: smallprint printgap noloewdin
keywords: NOSOSCF
formula: C16H20O6P2S3
InChI: InChI=1/C16H20O6P2S3/c1-17-23(25,18-2)21-13-5-9-15(10-6-13)27-16-11-7-14(8-12-16)22-24(26,19-3)20-4/h5-12H,1-4H3
47 atoms
S  0.105784 -3.005812 0.239448
S  -6.500048 -0.859691 0.66934
S  5.451727 0.942546 2.069344
P  -5.811984 0.724096 -0.158512
P  5.666647 1.192881 0.18516
O  -4.229194 1.004588 0.025302
O  5.112335 -0.013182 -0.750794
O  -6.402305 2.121442 0.322387
O  -5.939357 0.844483 -1.740436
O  4.9659 2.515428 -0.343397
O  7.140866 1.328708 -0.40122
C  -1.186159 -1.799773 0.165624
C  1.559262 -2.032749 -0.033652
C  -3.255724 0.032727 0.057042
C  3.923491 -0.663333 -0.485674
C  -1.285716 -0.801389 1.131422
C  2.764953 -2.534874 0.450457
C  -2.135586 -1.877145 -0.844834
C  1.549988 -0.838032 -0.746699
C  -2.316181 0.119472 1.075016
C  3.949244 -1.853703 0.221058
C  -3.179345 -0.964294 -0.901903
C  2.730945 -0.144617 -0.962004
C  -6.699482 2.364831 1.703257
C  -7.15932 0.489939 -2.406145
C  5.036704 2.930997 -1.718762
C  8.141688 0.341421 -0.122242
H  -0.558127 -0.738369 1.930034
H  2.787961 -3.456885 1.017725
H  -2.062128 -2.644471 -1.603901
H  0.626279 -0.435419 -1.140313
H  -2.39509 0.899976 1.82053
H  4.885247 -2.247929 0.593996
H  -3.897455 -1.027218 -1.708484
H  2.718735 0.782386 -1.521381
H  -7.086811 3.378198 1.76074
H  -5.804155 2.287772 2.319855
H  -7.454011 1.668531 2.067416
H  -7.977691 1.141485 -2.101006
H  -6.978502 0.615626 -3.469874
H  -7.425499 -0.547491 -2.205884
H  5.991552 3.413605 -1.92024
H  4.896493 2.097271 -2.40599
H  4.233582 3.64738 -1.866908
H  7.910262 -0.600216 -0.619485
H  9.079917 0.729774 -0.508157
H  8.237155 0.173196 0.950564
elementType: S P O C H
totalener: -2950.72241773 hartree
nucrepener: 3261.83824395 hartree
electener: -6212.56066168 hartree
twoeener: 4342.68173241 hartree
cpcmener: -0.03940336 hartree
kineticenergy: 2942.55182577 hartree
xcener: -192.747915409727 hartree
chargesum: 0.0000000
charge: -0.049959 -0.448429 -0.436243 0.766693 0.735749 -0.332827 -0.359422 -0.346150 -0.344801 -0.350745 -0.336966 0.047062 0.064465 0.233012 0.231895 -0.142704 -0.153212 -0.142541 -0.173164 -0.169961 -0.177454 -0.164475 -0.171656 -0.115274 -0.116377 -0.123788 -0.105587 0.151447 0.135204 0.138881 0.150824 0.154121 0.146986 0.151820 0.162531 0.131087 0.127838 0.112169 0.131605 0.131375 0.111692 0.129298 0.122611 0.131327 0.126576 0.130803 0.104665
qa: -0.0500 -0.4484 -0.4362 0.7667 0.7357 -0.3328 -0.3594 -0.3462 -0.3448 -0.3507 -0.3370 0.0471 0.0645 0.2330 0.2319 -0.1427 -0.1532 -0.1425 -0.1732 -0.1700 -0.1775 -0.1645 -0.1717 -0.1153 -0.1164 -0.1238 -0.1056 0.1514 0.1352 0.1389 0.1508 0.1541 0.1470 0.1518 0.1625 0.1311 0.1278 0.1122 0.1316 0.1314 0.1117 0.1293 0.1226 0.1313 0.1266 0.1308 0.1047
va: 2.3498 1.9838 2.0161 5.4749 5.5084 2.1247 2.0484 2.0990 2.0901 2.1001 2.0842 3.7235 3.7747 3.7564 3.7129 3.9553 3.9527 4.0229 3.9425 3.9850 4.0419 3.9646 4.0311 3.8393 3.8333 3.8363 3.8350 0.9954 1.0101 1.0141 0.9947 0.9988 1.0012 1.0090 0.9890 0.9912 0.9850 0.9995 0.9885 0.9904 1.0004 0.9937 0.9901 0.9886 0.9892 0.9890 1.0021
dispcorr: -0.023649526 hartree
energy: -2950.746067256781
dipole: -0.25868 0.16112 -0.09756 6.59189 -5.48277 1.10912 -8.24436 5.95280 -2.29156
magnitude: 2.54773 au
magnitude: 6.47582 debye
