program: Orca
programVersion: 5.0.2
elementType: S S S P P O O O O O O C C C C C C C C C C C C C C C C H H H H H H H H H H H H H H H H H H H H
charge: 0
multiplicity: 1
keywords: wb97x-d3
keywords: def2-TZVPP
keywords: def2/J RIJCOSX
keywords: DEFGRID2
keywords: scfconv7
keywords: smallprint printgap noloewdin
keywords: NOSOSCF
formula: C16H20O6P2S3
InChI: InChI=1/C16H20O6P2S3/c1-17-23(25,18-2)21-13-5-9-15(10-6-13)27-16-11-7-14(8-12-16)22-24(26,19-3)20-4/h5-12H,1-4H3
47 atoms
S  0.100176 -3.030844 0.202988
S  -6.470736 -0.825508 0.715474
S  5.421448 0.958424 2.070669
P  -5.789639 0.744461 -0.143646
P  5.637574 1.175422 0.182366
O  -4.201655 1.01701 0.001619
O  5.145046 -0.079478 -0.725592
O  -6.361637 2.149997 0.336178
O  -5.951997 0.849772 -1.723357
O  4.876375 2.448996 -0.382509
O  7.108991 1.363532 -0.397055
C  -1.177718 -1.809469 0.130861
C  1.566231 -2.072117 -0.053106
C  -3.234325 0.038407 0.031176
C  3.946583 -0.722121 -0.479592
C  -1.258011 -0.802086 1.089222
C  2.755853 -2.561688 0.480155
C  -2.140055 -1.888003 -0.867394
C  1.581009 -0.900872 -0.80394
C  -2.282338 0.1260 1.037521
C  3.948365 -1.889545 0.264704
C  -3.176773 -0.966701 -0.920221
C  2.769286 -0.217088 -1.007385
C  -6.618284 2.410582 1.722086
C  -7.18698 0.491209 -2.358175
C  4.94248 2.839178 -1.765844
C  8.160728 0.452744 -0.05157
H  -0.521448 -0.73873 1.879559
H  2.759117 -3.464651 1.077568
H  -2.081058 -2.661099 -1.621867
H  0.669792 -0.510007 -1.236836
H  -2.346714 0.912455 1.778145
H  4.871882 -2.273037 0.677706
H  -3.9050 -1.0299 -1.717784
H  2.773983 0.689901 -1.598374
H  -5.709994 2.317606 2.31759
H  -7.379613 1.734619 2.110019
H  -6.980657 3.433279 1.780925
H  -7.033668 0.620526 -3.425879
H  -7.442603 -0.548195 -2.153492
H  -8.000512 1.138295 -2.030662
H  5.869536 3.374255 -1.96427
H  4.863313 1.984805 -2.437101
H  4.0998 3.502096 -1.940558
H  9.078173 0.865537 -0.461324
H  8.25918 0.362066 1.030115
H  7.983516 -0.531033 -0.485395
elementType: S P O C H
totalener: -2950.72239487 hartree
nucrepener: 3264.53360844 hartree
electener: -6215.25600330 hartree
twoeener: 4345.38709727 hartree
cpcmener: -0.03950014 hartree
kineticenergy: 2942.54525269 hartree
xcener: -192.746279137178 hartree
chargesum: -0.0000000
charge: -0.050587 -0.448453 -0.437385 0.766258 0.737596 -0.333499 -0.358553 -0.346204 -0.344891 -0.350410 -0.336900 0.042780 0.061754 0.232713 0.229161 -0.137635 -0.152185 -0.142159 -0.174834 -0.172211 -0.177903 -0.165130 -0.166798 -0.115256 -0.116506 -0.125316 -0.106751 0.151584 0.135374 0.139016 0.152014 0.154166 0.146917 0.151957 0.164191 0.127431 0.112573 0.131094 0.131389 0.112039 0.131325 0.129997 0.122765 0.132216 0.130604 0.105351 0.127304
qa: -0.0506 -0.4485 -0.4374 0.7663 0.7376 -0.3335 -0.3586 -0.3462 -0.3449 -0.3504 -0.3369 0.0428 0.0618 0.2327 0.2292 -0.1376 -0.1522 -0.1422 -0.1748 -0.1722 -0.1779 -0.1651 -0.1668 -0.1153 -0.1165 -0.1253 -0.1068 0.1516 0.1354 0.1390 0.1520 0.1542 0.1469 0.1520 0.1642 0.1274 0.1126 0.1311 0.1314 0.1120 0.1313 0.1300 0.1228 0.1322 0.1306 0.1054 0.1273
va: 2.3468 1.9837 2.0158 5.4753 5.5065 2.1232 2.0496 2.0983 2.0900 2.1000 2.0850 3.7233 3.7697 3.7537 3.7222 3.9507 3.9553 4.0193 3.9512 3.9878 4.0449 3.9676 4.0202 3.8399 3.8338 3.8361 3.8348 0.9949 1.0105 1.0141 0.9937 0.9987 1.0017 1.0088 0.9874 0.9850 0.9993 0.9912 0.9906 1.0001 0.9885 0.9938 0.9900 0.9881 0.9890 1.0019 0.9886
dispcorr: -0.023668063 hartree
energy: -2950.746062929348
dipole: -0.19766 0.16760 -0.03006 6.72827 -5.60167 1.12661 -8.05187 5.78628 -2.26559
magnitude: 2.53043 au
magnitude: 6.43183 debye
