program: Orca
programVersion: 5.0.2
elementType: S S S P P O O O O O O C C C C C C C C C C C C C C C C H H H H H H H H H H H H H H H H H H H H
charge: 0
multiplicity: 1
keywords: wb97x-d3
keywords: def2-TZVPP
keywords: def2/J RIJCOSX
keywords: DEFGRID2
keywords: scfconv7
keywords: smallprint printgap noloewdin
keywords: NOSOSCF
formula: C16H20O6P2S3
InChI: InChI=1/C16H20O6P2S3/c1-17-23(25,18-2)21-13-5-9-15(10-6-13)27-16-11-7-14(8-12-16)22-24(26,19-3)20-4/h5-12H,1-4H3
47 atoms
S  0.063549 -3.001853 -0.128913
S  -6.58695 -0.970619 -0.344994
S  6.128636 -0.411503 1.960027
P  -5.788793 0.769435 -0.30011
P  5.896866 0.822928 0.518544
O  -4.356649 0.883741 0.439641
O  4.931537 0.31325 -0.68644
O  -6.584795 1.924238 0.453465
O  -5.448615 1.45565 -1.696051
O  5.31183 2.227791 0.980308
O  7.175213 1.245976 -0.331315
C  -1.252313 -1.825914 0.016273
C  1.484963 -1.955938 -0.28147
C  -3.351821 -0.047768 0.264727
C  3.791139 -0.435774 -0.503505
C  -1.417524 -0.806716 -0.918616
C  1.639833 -0.801727 0.481271
C  -2.156761 -1.957011 1.063595
C  2.497194 -2.342977 -1.152888
C  -2.461726 0.092772 -0.790258
C  2.783757 -0.030889 0.360983
C  -3.221123 -1.074604 1.182352
C  3.659591 -1.592903 -1.251981
C  -7.299352 1.657782 1.666972
C  -6.405034 1.449765 -2.764515
C  4.972143 3.272172 0.049948
C  8.147533 0.276576 -0.744335
H  -0.726629 -0.702797 -1.745083
H  0.865717 -0.48907 1.169586
H  -2.031488 -2.742165 1.797559
H  2.38595 -3.230612 -1.762223
H  -2.576874 0.898877 -1.502931
H  2.876889 0.878551 0.94059
H  -3.921853 -1.170036 2.001061
H  4.449591 -1.897185 -1.926264
H  -8.105392 0.945196 1.496013
H  -7.720022 2.605429 1.991649
H  -6.635204 1.277197 2.442902
H  -6.642936 0.43085 -3.068777
H  -7.319977 1.96764 -2.477413
H  -5.943273 1.975162 -3.595769
H  4.33083 2.90409 -0.750591
H  4.431305 4.024623 0.617693
H  5.870182 3.718663 -0.374435
H  8.884259 0.810861 -1.338092
H  8.637153 -0.170935 0.120108
H  7.696827 -0.506505 -1.354622
elementType: S P O C H
totalener: -2950.72197169 hartree
nucrepener: 3254.83964840 hartree
electener: -6205.56162008 hartree
twoeener: 4335.63441607 hartree
cpcmener: -0.03881071 hartree
kineticenergy: 2942.53117889 hartree
xcener: -192.743286942486 hartree
chargesum: -0.0000000
charge: -0.048237 -0.451818 -0.433510 0.772002 0.735031 -0.354864 -0.340267 -0.344759 -0.343980 -0.350276 -0.340506 0.040567 0.038703 0.238041 0.233955 -0.151922 -0.155110 -0.134646 -0.140971 -0.161990 -0.160344 -0.187036 -0.191288 -0.112508 -0.116574 -0.117093 -0.113738 0.154428 0.156244 0.138050 0.137040 0.158150 0.150572 0.153068 0.152909 0.113251 0.131204 0.126750 0.112702 0.127472 0.129502 0.123321 0.129975 0.129294 0.131350 0.111745 0.126109
qa: -0.0482 -0.4518 -0.4335 0.7720 0.7350 -0.3549 -0.3403 -0.3448 -0.3440 -0.3503 -0.3405 0.0406 0.0387 0.2380 0.2340 -0.1519 -0.1551 -0.1346 -0.1410 -0.1620 -0.1603 -0.1870 -0.1913 -0.1125 -0.1166 -0.1171 -0.1137 0.1544 0.1562 0.1381 0.1370 0.1582 0.1506 0.1531 0.1529 0.1133 0.1312 0.1268 0.1127 0.1275 0.1295 0.1233 0.1300 0.1293 0.1314 0.1117 0.1261
va: 2.3423 1.9863 2.0135 5.4867 5.4915 2.1005 2.0618 2.0919 2.1090 2.0865 2.0841 3.7201 3.7427 3.7200 3.7205 3.9480 3.9386 3.9798 3.9715 4.0288 3.9508 4.0318 4.0449 3.8368 3.8442 3.8277 3.8422 0.9915 0.9898 1.0128 1.0113 1.0039 1.0068 1.0001 0.9980 0.9993 0.9914 0.9852 0.9987 0.9863 0.9906 0.9914 0.9889 0.9941 0.9902 0.9984 0.9855
dispcorr: -0.023520050 hartree
energy: -2950.745491735930
dipole: -2.02392 1.64659 -0.37734 10.52470 -8.26063 2.26408 -6.88763 5.08035 -1.80729
magnitude: 2.92142 au
magnitude: 7.42567 debye
