program: Orca
programVersion: 5.0.2
elementType: S S S P P O O O O O O C C C C C C C C C C C C C C C C H H H H H H H H H H H H H H H H H H H H
charge: 0
multiplicity: 1
keywords: wb97x-d3
keywords: def2-TZVPP
keywords: def2/J RIJCOSX
keywords: DEFGRID2
keywords: scfconv7
keywords: smallprint printgap noloewdin
keywords: NOSOSCF
formula: C16H20O6P2S3
InChI: InChI=1/C16H20O6P2S3/c1-17-23(25,18-2)21-13-5-9-15(10-6-13)27-16-11-7-14(8-12-16)22-24(26,19-3)20-4/h5-12H,1-4H3
47 atoms
S  -0.06941 -2.705943 -0.677157
S  -6.660939 -0.895927 0.286892
S  6.824094 -1.125312 -0.891439
P  -5.991218 0.898274 0.27197
P  6.075368 0.463249 -0.131117
O  -4.420843 1.080631 0.614712
O  4.79711 0.294325 0.842104
O  -6.630371 1.929321 1.303474
O  -6.073986 1.709053 -1.096599
O  7.087944 1.212804 0.836048
O  5.496702 1.545069 -1.155775
C  -1.371101 -1.568138 -0.294163
C  1.36239 -1.770032 -0.217355
C  -3.441912 0.171416 0.281783
C  3.667034 -0.399991 0.453688
C  -2.247288 -1.170586 -1.295236
C  1.468873 -0.408216 -0.486509
C  -1.545827 -1.096501 1.004697
C  2.420884 -2.438867 0.387925
C  -3.292494 -0.302879 -1.010852
C  2.619135 0.282076 -0.143958
C  -2.577327 -0.22181 1.29326
C  3.583592 -1.756637 0.713507
C  -7.035028 1.50958 2.613574
C  -7.278804 1.69822 -1.875038
C  6.72265 2.390215 1.57733
C  6.22899 1.90337 -2.334716
H  -2.113885 -1.524007 -2.309042
H  0.655573 0.124973 -0.961089
H  -0.876832 -1.409329 1.795687
H  2.343146 -3.493729 0.617637
H  -3.953705 0.01498 -1.805967
H  2.693795 1.344081 -0.337095
H  -2.715558 0.150239 2.300156
H  4.403847 -2.274548 1.192126
H  -7.817087 0.753277 2.555899
H  -7.424611 2.392138 3.113051
H  -6.191591 1.118626 3.182335
H  -7.535915 0.684524 -2.180888
H  -8.109902 2.1334 -1.320484
H  -7.082495 2.301236 -2.757091
H  6.153059 3.093693 0.970807
H  6.147089 2.12025 2.461354
H  7.651023 2.863201 1.885495
H  7.192452 2.345029 -2.081122
H  6.382989 1.03586 -2.975739
H  5.626797 2.639107 -2.860672
elementType: S P O C H
totalener: -2950.72116811 hartree
nucrepener: 3242.22479672 hartree
electener: -6192.94596483 hartree
twoeener: 4323.12300294 hartree
cpcmener: -0.03841364 hartree
kineticenergy: 2942.56072019 hartree
xcener: -192.748029896114 hartree
chargesum: 0.0000000
charge: -0.057666 -0.448936 -0.438563 0.767658 0.735227 -0.336121 -0.354183 -0.347045 -0.345236 -0.343476 -0.334569 0.041121 0.031068 0.234892 0.261035 -0.152121 -0.142283 -0.127171 -0.136993 -0.162248 -0.191092 -0.182240 -0.198847 -0.115678 -0.116089 -0.111150 -0.111197 0.138671 0.156167 0.150635 0.137242 0.152300 0.155318 0.154615 0.149063 0.113358 0.131349 0.127394 0.111991 0.130015 0.131189 0.122429 0.121011 0.128523 0.127838 0.114284 0.128508
qa: -0.0577 -0.4489 -0.4386 0.7677 0.7352 -0.3361 -0.3542 -0.3470 -0.3452 -0.3435 -0.3346 0.0411 0.0311 0.2349 0.2610 -0.1521 -0.1423 -0.1272 -0.1370 -0.1622 -0.1911 -0.1822 -0.1988 -0.1157 -0.1161 -0.1112 -0.1112 0.1387 0.1562 0.1506 0.1372 0.1523 0.1553 0.1546 0.1491 0.1134 0.1313 0.1274 0.1120 0.1300 0.1312 0.1224 0.1210 0.1285 0.1278 0.1143 0.1285
va: 2.3191 1.9821 2.0236 5.4708 5.5193 2.1212 2.0839 2.0955 2.0907 2.0967 2.0619 3.7063 3.7628 3.7424 3.6852 4.0181 3.9028 3.9322 3.9621 3.9695 4.0485 3.9999 4.0501 3.8384 3.8360 3.8414 3.8340 1.0145 0.9880 0.9940 1.0121 1.0083 1.0051 0.9984 1.0062 0.9994 0.9916 0.9851 0.9997 0.9886 0.9907 0.9921 0.9909 0.9895 0.9851 1.0022 0.9910
dispcorr: -0.023310759 hartree
energy: -2950.744478865397
dipole: -4.23608 3.08065 -1.15543 14.67692 -11.29926 3.37766 0.63089 -0.19507 0.43582
magnitude: 3.59632 au
magnitude: 9.14112 debye
