program: Orca
programVersion: 5.0.2
elementType: S S S P P O O O O O O C C C C C C C C C C C C C C C C H H H H H H H H H H H H H H H H H H H H
charge: 0
multiplicity: 1
keywords: wb97x-d3
keywords: def2-TZVPP
keywords: def2/J RIJCOSX
keywords: DEFGRID2
keywords: scfconv7
keywords: smallprint printgap noloewdin
keywords: NOSOSCF
formula: C16H20O6P2S3
InChI: InChI=1/C16H20O6P2S3/c1-17-23(25,18-2)21-13-5-9-15(10-6-13)27-16-11-7-14(8-12-16)22-24(26,19-3)20-4/h5-12H,1-4H3
47 atoms
S  0.117164 -2.759371 0.547249
S  -6.212305 -0.730692 1.573884
S  5.200193 1.731642 1.293978
P  -6.028282 0.443372 0.072376
P  5.980273 0.980783 -0.286261
O  -4.514787 0.793548 -0.378972
O  5.013123 0.064784 -1.203801
O  -6.64583 1.904954 0.203871
O  -6.630326 -0.035667 -1.321261
O  6.558194 1.997696 -1.369019
O  7.211503 -0.011382 -0.103847
C  -1.230345 -1.657529 0.229586
C  1.538854 -1.835423 0.039275
C  -3.443992 -0.050563 -0.174565
C  3.870129 -0.560369 -0.74792
C  -1.308825 -0.410256 0.844655
C  2.748427 -2.133459 0.66102
C  -2.267202 -2.088661 -0.589212
C  1.508177 -0.892378 -0.983437
C  -2.412903 0.398228 0.637361
C  3.919035 -1.507168 0.261733
C  -3.384507 -1.29004 -0.787617
C  2.670869 -0.241347 -1.363464
C  -6.467339 2.667935 1.404511
C  -7.962003 -0.563391 -1.396065
C  5.813547 3.164867 -1.739633
C  8.291169 0.318908 0.780085
H  -0.512234 -0.06798 1.49226
H  2.787718 -2.857254 1.465208
H  -2.210264 -3.050747 -1.080668
H  0.581271 -0.651621 -1.486962
H  -2.479305 1.367745 1.113858
H  4.855507 -1.76266 0.740718
H  -4.18476 -1.62955 -1.432305
H  2.645273 0.500349 -2.151477
H  -6.96567 2.189426 2.246798
H  -6.918434 3.639656 1.223558
H  -5.410553 2.803174 1.636026
H  -8.071595 -1.437623 -0.755018
H  -8.698942 0.18909 -1.116111
H  -8.122529 -0.8532 -2.430564
H  4.840132 2.899364 -2.152511
H  5.677422 3.827021 -0.885124
H  6.396156 3.674673 -2.501778
H  8.993192 -0.508901 0.732499
H  8.793851 1.233286 0.466159
H  7.935632 0.430751 1.803973
elementType: S P O C H
totalener: -2950.72138158 hartree
nucrepener: 3240.78546167 hartree
electener: -6191.50684326 hartree
twoeener: 4321.88987457 hartree
cpcmener: -0.03711223 hartree
kineticenergy: 2942.54365767 hartree
xcener: -192.746399447868 hartree
chargesum: 0.0000000
charge: -0.041544 -0.449347 -0.452410 0.767766 0.773561 -0.346129 -0.348966 -0.345274 -0.343963 -0.346134 -0.346086 0.044670 0.055407 0.223615 0.214502 -0.151173 -0.162481 -0.140758 -0.164027 -0.168086 -0.156748 -0.160203 -0.179423 -0.114555 -0.115994 -0.115904 -0.117772 0.155489 0.136774 0.139279 0.155473 0.157306 0.151991 0.155482 0.155238 0.112293 0.131756 0.125614 0.111371 0.128411 0.130882 0.125371 0.111886 0.131230 0.131073 0.128512 0.112029
qa: -0.0415 -0.4493 -0.4524 0.7678 0.7736 -0.3461 -0.3490 -0.3453 -0.3440 -0.3461 -0.3461 0.0447 0.0554 0.2236 0.2145 -0.1512 -0.1625 -0.1408 -0.1640 -0.1681 -0.1567 -0.1602 -0.1794 -0.1146 -0.1160 -0.1159 -0.1178 0.1555 0.1368 0.1393 0.1555 0.1573 0.1520 0.1555 0.1552 0.1123 0.1318 0.1256 0.1114 0.1284 0.1309 0.1254 0.1119 0.1312 0.1311 0.1285 0.1120
va: 2.3641 1.9829 1.9790 5.4770 5.4670 2.1071 2.1051 2.0972 2.0987 2.0958 2.0926 3.7259 3.7758 3.7393 3.7319 3.9513 3.9692 4.0064 3.9233 3.9964 3.9784 3.9888 4.0149 3.8447 3.8388 3.8475 3.8405 0.9921 1.0118 1.0137 0.9898 0.9946 1.0061 1.0058 0.9971 0.9991 0.9913 0.9842 0.9995 0.9882 0.9901 0.9838 0.9992 0.9911 0.9903 0.9881 0.9992
dispcorr: -0.023093758 hartree
energy: -2950.744475341531
dipole: -0.28034 0.20166 -0.07868 8.42633 -6.93921 1.48712 -2.77413 1.69085 -1.08328
magnitude: 1.84153 au
magnitude: 4.68078 debye
