program: Orca
programVersion: 5.0.2
elementType: S S S P P O O O O O O C C C C C C C C C C C C C C C C H H H H H H H H H H H H H H H H H H H H
charge: 0
multiplicity: 1
keywords: wb97x-d3
keywords: def2-TZVPP
keywords: def2/J RIJCOSX
keywords: DEFGRID2
keywords: scfconv7
keywords: smallprint printgap noloewdin
keywords: NOSOSCF
formula: C16H20O6P2S3
InChI: InChI=1/C16H20O6P2S3/c1-17-23(25,18-2)21-13-5-9-15(10-6-13)27-16-11-7-14(8-12-16)22-24(26,19-3)20-4/h5-12H,1-4H3
47 atoms
S  0.047911 -3.628283 -0.309787
S  -4.912724 1.376297 -2.102009
S  6.773448 1.775554 1.068481
P  -5.127145 1.213504 -0.205387
P  5.159188 1.046736 0.344867
O  -4.711103 -0.198796 0.456831
O  4.876697 -0.43669 0.918863
O  -6.600834 1.366115 0.37412
O  -4.303024 2.209873 0.722965
O  3.77589 1.76011 0.676638
O  5.076152 0.937061 -1.245353
C  -1.321973 -2.530918 -0.083612
C  1.447769 -2.608293 0.051744
C  -3.56731 -0.926264 0.225821
C  3.723694 -1.140386 0.604253
C  -2.52216 -3.078851 0.359591
C  2.50805 -2.599054 -0.846086
C  -1.262418 -1.173943 -0.380461
C  1.540048 -1.88419 1.238504
C  -3.647046 -2.283414 0.497126
C  3.657851 -1.872646 -0.567252
C  -2.374892 -0.364444 -0.20897
C  2.670196 -1.132458 1.50707
C  -7.738997 0.843835 -0.323424
C  -4.22904 3.608119 0.413853
C  3.548003 3.127873 0.310661
C  6.21661 0.544263 -2.018945
H  -2.588177 -4.130883 0.605968
H  2.44364 -3.154864 -1.772219
H  -0.344457 -0.725737 -0.736817
H  0.727231 -1.894477 1.952982
H  -4.57853 -2.714201 0.840617
H  4.488539 -1.88547 -1.260768
H  -2.284593 0.69228 -0.420079
H  2.741482 -0.56438 2.425319
H  -7.676808 -0.239439 -0.424821
H  -7.835113 1.298077 -1.308878
H  -8.609332 1.097167 0.275603
H  -3.802391 3.767708 -0.576112
H  -5.212587 4.074525 0.466808
H  -3.579862 4.056131 1.160881
H  4.327047 3.77595 0.712666
H  3.502574 3.240212 -0.771989
H  2.591215 3.410175 0.740678
H  6.612966 -0.415867 -1.688479
H  5.876409 0.454301 -3.046969
H  6.999831 1.299354 -1.961224
elementType: S P O C H
totalener: -2950.72077329 hartree
nucrepener: 3303.97977071 hartree
electener: -6254.70054400 hartree
twoeener: 4384.24058499 hartree
cpcmener: -0.03798196 hartree
kineticenergy: 2942.54402198 hartree
xcener: -192.747843536159 hartree
chargesum: 0.0000000
charge: -0.038194 -0.449511 -0.437380 0.761444 0.727354 -0.317303 -0.352346 -0.346831 -0.342866 -0.329267 -0.339176 0.034244 0.046302 0.254312 0.252387 -0.138793 -0.148912 -0.183710 -0.153853 -0.196128 -0.178241 -0.158498 -0.183728 -0.117085 -0.114951 -0.107037 -0.116592 0.136587 0.137822 0.157471 0.157714 0.150908 0.164105 0.130211 0.153389 0.127621 0.112861 0.131127 0.111625 0.130381 0.131482 0.106565 0.124766 0.128107 0.125144 0.134774 0.121699
qa: -0.0382 -0.4495 -0.4374 0.7614 0.7274 -0.3173 -0.3523 -0.3468 -0.3429 -0.3293 -0.3392 0.0342 0.0463 0.2543 0.2524 -0.1388 -0.1489 -0.1837 -0.1539 -0.1961 -0.1782 -0.1585 -0.1837 -0.1171 -0.1150 -0.1070 -0.1166 0.1366 0.1378 0.1575 0.1577 0.1509 0.1641 0.1302 0.1534 0.1276 0.1129 0.1311 0.1116 0.1304 0.1315 0.1066 0.1248 0.1281 0.1251 0.1348 0.1217
va: 2.3739 1.9841 2.0213 5.4881 5.5152 2.1570 2.1053 2.1017 2.0826 2.0982 2.0528 3.7889 3.7322 3.7396 3.7277 3.9643 4.0032 3.9864 3.9288 4.0078 4.0282 3.9381 4.0016 3.8397 3.8332 3.8408 3.8208 1.0101 1.0149 0.9901 0.9890 1.0027 0.9859 1.0253 1.0011 0.9855 0.9992 0.9911 1.0001 0.9890 0.9902 1.0002 0.9907 0.9890 0.9853 0.9901 1.0042
dispcorr: -0.023365375 hartree
energy: -2950.744138664377
dipole: -6.27588 4.76074 -1.51514 9.00507 -8.05747 0.94760 -4.41229 3.70239 -0.70990
magnitude: 1.92290 au
magnitude: 4.88763 debye
