program: Orca
programVersion: 5.0.2
elementType: S S S P P O O O O O O C C C C C C C C C C C C C C C C H H H H H H H H H H H H H H H H H H H H
charge: 0
multiplicity: 1
keywords: wb97x-d3
keywords: def2-TZVPP
keywords: def2/J RIJCOSX
keywords: DEFGRID2
keywords: scfconv7
keywords: smallprint printgap noloewdin
keywords: NOSOSCF
formula: C16H20O6P2S3
InChI: InChI=1/C16H20O6P2S3/c1-17-23(25,18-2)21-13-5-9-15(10-6-13)27-16-11-7-14(8-12-16)22-24(26,19-3)20-4/h5-12H,1-4H3
47 atoms
S  0.191519 -2.624674 0.467387
S  -5.457502 1.666708 1.912342
S  5.758784 1.775365 1.292689
P  -6.105781 0.546168 0.501257
P  6.005474 0.966825 -0.424059
O  -5.009914 -0.012143 -0.55025
O  4.69031 0.754554 -1.342734
O  -7.156723 1.182964 -0.510254
O  -6.822598 -0.817256 0.907607
O  6.915174 1.844419 -1.386773
O  6.586601 -0.521778 -0.437263
C  -1.302607 -1.72011 0.193564
C  1.467103 -1.552111 -0.122363
C  -3.788097 -0.560783 -0.232429
C  3.626611 -0.019987 -0.915795
C  -1.549429 -1.004685 -0.975158
C  1.532987 -0.206303 0.228501
C  -2.305861 -1.833213 1.14848
C  2.484329 -2.118352 -0.883205
C  -2.781561 -0.408677 -1.177355
C  2.608556 0.565849 -0.177898
C  -3.555535 -1.269775 0.935379
C  3.576728 -1.35654 -1.270108
C  -7.081851 2.565084 -0.886923
C  -7.777617 -0.850251 1.977745
C  7.276956 1.408931 -2.709126
C  7.709577 -0.880507 0.378627
H  -0.784462 -0.907684 -1.734457
H  0.749555 0.245745 0.822612
H  -2.127166 -2.372833 2.069604
H  2.431548 -3.158387 -1.177596
H  -2.971906 0.150352 -2.084391
H  2.658101 1.614158 0.084185
H  -4.32147 -1.404924 1.686433
H  4.365589 -1.799154 -1.863567
H  -7.246142 3.211464 -0.025902
H  -7.871337 2.728134 -1.615152
H  -6.120659 2.802176 -1.342209
H  -8.144201 -1.871488 2.031065
H  -7.308756 -0.584081 2.924502
H  -8.614157 -0.17937 1.782782
H  6.425783 1.47707 -3.384845
H  8.058994 2.08142 -3.050423
H  7.662851 0.390212 -2.706858
H  7.90347 -1.933469 0.193037
H  8.592729 -0.300941 0.110451
H  7.484862 -0.735526 1.435026
elementType: S P O C H
totalener: -2950.72048094 hartree
nucrepener: 3228.89631675 hartree
electener: -6179.61679768 hartree
twoeener: 4309.98924585 hartree
cpcmener: -0.03841594 hartree
kineticenergy: 2942.53079772 hartree
xcener: -192.744410414573 hartree
chargesum: 0.0000000
charge: -0.035075 -0.446871 -0.436875 0.762771 0.733834 -0.322157 -0.357638 -0.348675 -0.345582 -0.342260 -0.333617 0.029224 0.030208 0.252925 0.262972 -0.139380 -0.141544 -0.166016 -0.140483 -0.197883 -0.193911 -0.164078 -0.183767 -0.114686 -0.114825 -0.112747 -0.111682 0.156752 0.158858 0.137041 0.138975 0.152166 0.150065 0.136503 0.154043 0.114542 0.131136 0.126489 0.131413 0.113386 0.130058 0.123667 0.129075 0.121785 0.128538 0.128184 0.115144
qa: -0.0351 -0.4469 -0.4369 0.7628 0.7338 -0.3222 -0.3576 -0.3487 -0.3456 -0.3423 -0.3336 0.0292 0.0302 0.2529 0.2630 -0.1394 -0.1415 -0.1660 -0.1405 -0.1979 -0.1939 -0.1641 -0.1838 -0.1147 -0.1148 -0.1127 -0.1117 0.1568 0.1589 0.1370 0.1390 0.1522 0.1501 0.1365 0.1540 0.1145 0.1311 0.1265 0.1314 0.1134 0.1301 0.1237 0.1291 0.1218 0.1285 0.1282 0.1151
va: 2.3795 1.9853 2.0269 5.4774 5.5188 2.1483 2.0828 2.0982 2.0804 2.0984 2.0581 3.7753 3.7610 3.7450 3.6960 3.9301 3.9356 4.0165 3.9643 3.9907 4.0319 3.9587 4.0497 3.8367 3.8337 3.8410 3.8337 0.9877 0.9880 1.0147 1.0126 1.0031 1.0072 1.0183 1.0031 0.9984 0.9918 0.9864 0.9909 0.9988 0.9892 0.9915 0.9892 0.9911 0.9907 0.9842 1.0026
dispcorr: -0.023086573 hartree
energy: -2950.743567510818
dipole: 0.74659 -0.68157 0.06503 -1.86774 0.84424 -1.02350 -5.97144 3.93544 -2.03600
magnitude: 2.27971 au
magnitude: 5.79456 debye
