program: Orca
programVersion: 5.0.2
elementType: S S S P P O O O O O O C C C C C C C C C C C C C C C C H H H H H H H H H H H H H H H H H H H H
charge: 0
multiplicity: 1
keywords: wb97x-d3
keywords: def2-TZVPP
keywords: def2/J RIJCOSX
keywords: DEFGRID2
keywords: scfconv7
keywords: smallprint printgap noloewdin
keywords: NOSOSCF
formula: C16H20O6P2S3
InChI: InChI=1/C16H20O6P2S3/c1-17-23(25,18-2)21-13-5-9-15(10-6-13)27-16-11-7-14(8-12-16)22-24(26,19-3)20-4/h5-12H,1-4H3
47 atoms
S  -0.014663 -3.625208 -0.558829
S  -4.945546 1.388621 -1.879181
S  6.89105 1.563188 0.752295
P  -5.070122 1.26435 0.028338
P  5.126204 1.002435 0.272145
O  -4.624193 -0.137213 0.696642
O  4.872701 -0.535396 0.693705
O  -6.512932 1.438941 0.674855
O  -4.195345 2.273314 0.895256
O  3.885526 1.715201 0.971222
O  4.725674 1.117745 -1.268346
C  -1.346845 -2.52314 -0.182427
C  1.409372 -2.645678 -0.180448
C  -3.520221 -0.886391 0.360698
C  3.702185 -1.210173 0.382185
C  -2.524176 -3.065158 0.322578
C  1.547352 -2.004378 1.048304
C  -1.272373 -1.154928 -0.41951
C  2.432569 -2.570726 -1.117193
C  -3.61646 -2.251625 0.576692
C  2.686183 -1.268603 1.324688
C  -2.346471 -0.330211 -0.128978
C  3.59043 -1.860015 -0.833635
C  -7.682814 0.894742 0.049907
C  -4.160089 3.670518 0.57161
C  3.669779 3.124777 0.817734
C  5.674052 0.864363 -2.312273
H  -2.598268 -4.125715 0.525903
H  0.762548 -2.065763 1.79094
H  -0.370632 -0.7116 -0.820294
H  2.332003 -3.060903 -2.076659
H  -4.532205 -2.676747 0.966432
H  2.79277 -0.768354 2.27816
H  -2.242706 0.733731 -0.291816
H  4.393539 -1.819551 -1.558125
H  -7.801825 1.281741 -0.961604
H  -8.529141 1.206303 0.655839
H  -7.641897 -0.193904 0.022115
H  -5.136208 4.131063 0.722428
H  -3.439964 4.126774 1.244901
H  -3.838642 3.825836 -0.458203
H  4.581846 3.687723 1.018796
H  3.312812 3.354594 -0.18552
H  2.910998 3.406284 1.542348
H  6.519307 1.548343 -2.242328
H  6.034899 -0.163617 -2.280154
H  5.15133 1.030305 -3.250545
elementType: S P O C H
totalener: -2950.72081024 hartree
nucrepener: 3311.48934563 hartree
electener: -6262.21015587 hartree
twoeener: 4391.74085812 hartree
cpcmener: -0.03826574 hartree
kineticenergy: 2942.55633043 hartree
xcener: -192.749887980693 hartree
chargesum: -0.0000000
charge: -0.041196 -0.449305 -0.437168 0.763650 0.724989 -0.321434 -0.351215 -0.346498 -0.343456 -0.332266 -0.338904 0.035111 0.047040 0.248387 0.251836 -0.139892 -0.153481 -0.179979 -0.147775 -0.193127 -0.180757 -0.157079 -0.185203 -0.117516 -0.114979 -0.103478 -0.110731 0.136954 0.156331 0.157513 0.137881 0.150873 0.154275 0.133465 0.166643 0.112325 0.131334 0.128251 0.130972 0.131430 0.110888 0.104467 0.125049 0.127961 0.119208 0.124667 0.133939
qa: -0.0412 -0.4493 -0.4372 0.7637 0.7250 -0.3214 -0.3512 -0.3465 -0.3435 -0.3323 -0.3389 0.0351 0.0470 0.2484 0.2518 -0.1399 -0.1535 -0.1800 -0.1478 -0.1931 -0.1808 -0.1571 -0.1852 -0.1175 -0.1150 -0.1035 -0.1107 0.1370 0.1563 0.1575 0.1379 0.1509 0.1543 0.1335 0.1666 0.1123 0.1313 0.1283 0.1310 0.1314 0.1109 0.1045 0.1250 0.1280 0.1192 0.1247 0.1339
va: 2.3665 1.9847 2.0195 5.4859 5.5180 2.1493 2.1110 2.1035 2.0849 2.0968 2.0513 3.7772 3.7292 3.7445 3.7287 3.9690 3.9295 3.9797 4.0053 4.0086 4.0117 3.9322 4.0263 3.8386 3.8318 3.8379 3.8172 1.0102 0.9896 0.9897 1.0149 1.0022 1.0018 1.0235 0.9850 0.9998 0.9907 0.9853 0.9892 0.9899 1.0009 1.0018 0.9909 0.9890 1.0056 0.9848 0.9901
dispcorr: -0.023436770 hartree
energy: -2950.744247009072
dipole: -7.22129 5.46303 -1.75826 10.16028 -8.95954 1.20074 -3.25192 2.75598 -0.49594
magnitude: 2.18614 au
magnitude: 5.55673 debye
