program: Orca
programVersion: 5.0.2
elementType: S S S P P O O O O O O C C C C C C C C C C C C C C C C H H H H H H H H H H H H H H H H H H H H
charge: 0
multiplicity: 1
keywords: wb97x-d3
keywords: def2-TZVPP
keywords: def2/J RIJCOSX
keywords: DEFGRID2
keywords: scfconv7
keywords: smallprint printgap noloewdin
keywords: NOSOSCF
formula: C16H20O6P2S3
InChI: InChI=1/C16H20O6P2S3/c1-17-23(25,18-2)21-13-5-9-15(10-6-13)27-16-11-7-14(8-12-16)22-24(26,19-3)20-4/h5-12H,1-4H3
47 atoms
S  -0.152666 -2.59711 -0.905471
S  -5.230718 2.068266 -0.902817
S  6.306449 -0.798089 -1.55705
P  -5.982094 1.011074 0.506849
P  6.073203 0.359307 -0.049861
O  -4.957745 0.05478 1.311561
O  4.548654 0.777699 0.299424
O  -7.114751 -0.042735 0.12587
O  -6.669459 1.792431 1.714151
O  6.560685 -0.17108 1.369965
O  6.759534 1.794753 -0.109542
C  -1.547721 -1.721603 -0.257182
C  1.216693 -1.553933 -0.494012
C  -3.838088 -0.523622 0.745272
C  3.459616 -0.02709 0.040154
C  -2.789956 -1.991026 -0.826502
C  1.357425 -0.294301 -1.071829
C  -1.46393 -0.843622 0.818534
C  2.203341 -2.036092 0.35756
C  -3.938451 -1.402307 -0.321403
C  2.476168 0.473984 -0.800831
C  -2.606811 -0.232206 1.308493
C  3.3342 -1.27672 0.623388
C  -8.186636 0.331727 -0.751224
C  -6.096249 3.0080 2.214323
C  7.839293 -0.805823 1.508308
C  6.740144 2.559264 -1.322536
H  -2.873355 -2.6639 -1.670783
H  0.597373 0.087419 -1.74105
H  -0.51099 -0.624884 1.281731
H  2.096688 -3.008438 0.819842
H  -4.898965 -1.636312 -0.762367
H  2.591577 1.452045 -1.249907
H  -2.539528 0.456039 2.141149
H  4.094795 -1.655214 1.293955
H  -8.728313 1.197723 -0.370951
H  -8.861239 -0.518779 -0.795019
H  -7.811965 0.546945 -1.75133
H  -6.714876 3.320762 3.051145
H  -5.075323 2.8523 2.56336
H  -6.103981 3.784422 1.449942
H  7.929431 -1.094891 2.551641
H  7.903081 -1.694617 0.881152
H  8.648397 -0.121177 1.254628
H  7.323551 2.067527 -2.099969
H  5.721495 2.718327 -1.677325
H  7.189279 3.520741 -1.08903
elementType: S P O C H
totalener: -2950.72165097 hartree
nucrepener: 3237.35257281 hartree
electener: -6188.07422379 hartree
twoeener: 4318.52446216 hartree
cpcmener: -0.03695512 hartree
kineticenergy: 2942.53545092 hartree
xcener: -192.744295354044 hartree
chargesum: -0.0000000
charge: -0.046541 -0.451594 -0.448646 0.768357 0.769479 -0.344690 -0.343883 -0.346474 -0.347710 -0.345323 -0.345989 0.062874 0.041413 0.205811 0.229972 -0.168989 -0.141055 -0.163939 -0.136744 -0.153965 -0.170621 -0.185001 -0.163350 -0.118086 -0.115611 -0.117672 -0.115292 0.136375 0.153054 0.153992 0.139649 0.154320 0.156120 0.154808 0.155545 0.128427 0.131413 0.114305 0.131233 0.126232 0.113361 0.131293 0.112440 0.129988 0.113647 0.125533 0.131537
qa: -0.0465 -0.4516 -0.4486 0.7684 0.7695 -0.3447 -0.3439 -0.3465 -0.3477 -0.3453 -0.3460 0.0629 0.0414 0.2058 0.2300 -0.1690 -0.1411 -0.1639 -0.1367 -0.1540 -0.1706 -0.1850 -0.1633 -0.1181 -0.1156 -0.1177 -0.1153 0.1364 0.1531 0.1540 0.1396 0.1543 0.1561 0.1548 0.1555 0.1284 0.1314 0.1143 0.1312 0.1262 0.1134 0.1313 0.1124 0.1300 0.1136 0.1255 0.1315
va: 2.3539 1.9795 1.9827 5.4699 5.4720 2.1092 2.1099 2.0916 2.0924 2.0956 2.0959 3.7880 3.7247 3.7393 3.7383 3.9769 3.9534 3.9130 4.0046 3.9821 3.9955 4.0237 3.9809 3.8395 3.8415 3.8374 3.8437 1.0113 0.9943 0.9910 1.0134 1.0063 0.9957 0.9978 1.0060 0.9883 0.9913 0.9980 0.9918 0.9847 0.9992 0.9906 0.9994 0.9878 0.9987 0.9846 0.9917
dispcorr: -0.023045699 hartree
energy: -2950.744696672675
dipole: -0.00826 0.10635 0.09809 7.30093 -6.07006 1.23087 3.33182 -2.22672 1.10510
magnitude: 1.65708 au
magnitude: 4.21196 debye
