program: Orca
programVersion: 5.0.2
elementType: S S S P P O O O O O O C C C C C C C C C C C C C C C C H H H H H H H H H H H H H H H H H H H H
charge: 0
multiplicity: 1
keywords: wb97x-d3
keywords: def2-TZVPP
keywords: def2/J RIJCOSX
keywords: DEFGRID2
keywords: scfconv7
keywords: smallprint printgap noloewdin
keywords: NOSOSCF
formula: C16H20O6P2S3
InChI: InChI=1/C16H20O6P2S3/c1-17-23(25,18-2)21-13-5-9-15(10-6-13)27-16-11-7-14(8-12-16)22-24(26,19-3)20-4/h5-12H,1-4H3
47 atoms
S  0.0395 -3.730644 0.264996
S  -4.573963 1.560395 2.212153
S  5.456553 1.066012 1.445535
P  -4.822334 1.434965 0.317386
P  4.928369 0.986597 -0.39683
O  -4.497027 0.011973 -0.370061
O  4.811459 -0.493627 -1.048392
O  -3.962424 2.403857 -0.60746
O  -6.295627 1.664549 -0.240147
O  3.541946 1.690459 -0.758563
O  5.92744 1.57112 -1.484605
C  -1.270831 -2.550013 0.104717
C  1.462258 -2.761493 -0.144497
C  -3.40581 -0.794465 -0.151887
C  3.70454 -1.267285 -0.741321
C  -1.105881 -1.197315 0.382613
C  2.519918 -2.705557 0.753973
C  -2.522725 -3.018927 -0.282746
C  1.547773 -2.089127 -1.362165
C  -2.164078 -0.313299 0.238825
C  3.654954 -1.964951 0.452817
C  -3.591984 -2.146845 -0.394418
C  2.661383 -1.322939 -1.654735
C  -3.713095 3.762804 -0.223115
C  -7.440225 1.145732 0.449637
C  2.474195 1.863416 0.183405
C  6.640065 2.790791 -1.235489
H  -0.14596 -0.809776 0.699013
H  2.461116 -3.226885 1.70045
H  -2.672134 -4.067155 -0.508732
H  0.736011 -2.142515 -2.076046
H  -1.994171 0.737711 0.430406
H  4.48002 -1.923407 1.151205
H  -4.563733 -2.514202 -0.698214
H  2.724133 -0.782424 -2.590282
H  -3.108437 4.199919 -1.013016
H  -3.165536 3.807306 0.717764
H  -4.642794 4.324548 -0.131691
H  -7.528602 1.583972 1.443084
H  -8.308103 1.421356 -0.143234
H  -7.394681 0.059863 0.53246
H  2.838235 2.290706 1.116871
H  1.767891 2.551616 -0.275522
H  1.971847 0.91658 0.388001
H  7.307313 2.683487 -0.38091
H  7.226749 2.990689 -2.128083
H  5.956415 3.621965 -1.06319
elementType: S P O C H
totalener: -2950.71813431 hartree
nucrepener: 3352.85346109 hartree
electener: -6303.57159539 hartree
twoeener: 4432.78857411 hartree
cpcmener: -0.03596896 hartree
kineticenergy: 2942.54790557 hartree
xcener: -192.750019260989 hartree
chargesum: 0.0000000
charge: -0.043831 -0.448968 -0.452023 0.760979 0.761755 -0.318202 -0.354063 -0.344983 -0.347287 -0.342012 -0.346142 0.011808 0.051744 0.260949 0.214545 -0.162259 -0.150115 -0.123300 -0.152695 -0.182296 -0.150459 -0.203279 -0.163452 -0.113838 -0.117073 -0.079356 -0.120205 0.167657 0.138467 0.135682 0.154315 0.131739 0.150519 0.150766 0.155302 0.131785 0.112024 0.130882 0.112905 0.131350 0.126407 0.114672 0.134269 0.100586 0.115364 0.131521 0.127847
qa: -0.0438 -0.4490 -0.4520 0.7610 0.7618 -0.3182 -0.3541 -0.3450 -0.3473 -0.3420 -0.3461 0.0118 0.0517 0.2609 0.2145 -0.1623 -0.1501 -0.1233 -0.1527 -0.1823 -0.1505 -0.2033 -0.1635 -0.1138 -0.1171 -0.0794 -0.1202 0.1677 0.1385 0.1357 0.1543 0.1317 0.1505 0.1508 0.1553 0.1318 0.1120 0.1309 0.1129 0.1313 0.1264 0.1147 0.1343 0.1006 0.1154 0.1315 0.1278
va: 2.3597 1.9832 1.9880 5.4863 5.4882 2.1522 2.0949 2.0793 2.0999 2.0700 2.1131 3.7951 3.7082 3.7339 3.7142 3.9510 4.0219 3.9512 3.9277 3.9673 3.9914 4.0139 3.9581 3.8326 3.8416 3.8190 3.8399 0.9773 1.0135 1.0100 0.9914 1.0231 1.0051 1.0026 0.9993 0.9908 0.9989 0.9888 0.9984 0.9910 0.9858 1.0086 0.9916 0.9888 0.9990 0.9912 0.9850
dispcorr: -0.024550752 hartree
energy: -2950.742685059625
dipole: -6.26558 4.93168 -1.33391 12.20958 -10.47841 1.73116 -2.93771 1.70535 -1.23236
magnitude: 2.50897 au
magnitude: 6.37730 debye
