program: Orca
programVersion: 5.0.2
elementType: S S S P P O O O O O O C C C C C C C C C C C C C C C C H H H H H H H H H H H H H H H H H H H H
charge: 0
multiplicity: 1
keywords: wb97x-d3
keywords: def2-TZVPP
keywords: def2/J RIJCOSX
keywords: DEFGRID2
keywords: scfconv7
keywords: smallprint printgap noloewdin
keywords: NOSOSCF
formula: C16H20O6P2S3
InChI: InChI=1/C16H20O6P2S3/c1-17-23(25,18-2)21-13-5-9-15(10-6-13)27-16-11-7-14(8-12-16)22-24(26,19-3)20-4/h5-12H,1-4H3
47 atoms
S  0.093898 -3.208516 0.581941
S  -5.053199 1.327366 2.149953
S  7.10929 1.92623 -0.338146
P  -5.645362 0.853181 0.391701
P  5.542007 0.923266 -0.779221
O  -4.529823 0.272612 -0.62561
O  5.097177 -0.056525 0.42419
O  -6.266105 2.018835 -0.496296
O  -6.757266 -0.278008 0.259523
O  4.235935 1.755715 -1.167123
O  5.633841 -0.109254 -1.986713
C  -1.240633 -2.096784 0.252863
C  1.53533 -2.190497 0.480038
C  -3.461474 -0.524806 -0.28273
C  3.899847 -0.757665 0.404993
C  -2.425155 -2.290443 0.95349
C  2.664949 -2.733686 -0.122102
C  -1.179117 -1.111222 -0.728956
C  1.600667 -0.922148 1.051128
C  -3.545848 -1.520959 0.676678
C  3.855937 -2.023151 -0.151499
C  -2.280392 -0.31164 -0.979515
C  2.778914 -0.19679 0.997741
C  -5.649428 3.312532 -0.541793
C  -7.871441 -0.322216 1.161093
C  3.90326 2.970028 -0.481339
C  6.18717 0.2863 -3.249107
H  -2.48829 -3.049429 1.722566
H  2.623978 -3.715151 -0.576236
H  -0.272145 -0.952395 -1.29723
H  0.735201 -0.490194 1.536181
H  -4.462143 -1.714704 1.217575
H  4.735941 -2.45897 -0.604903
H  -2.228142 0.464478 -1.732138
H  2.8296 0.788627 1.442661
H  -4.629644 3.250852 -0.92162
H  -5.643381 3.77575 0.444292
H  -6.246492 3.91611 -1.21952
H  -8.493268 0.56709 1.062191
H  -8.453556 -1.19799 0.888749
H  -7.53423 -0.419586 2.192428
H  3.786996 2.806792 0.589863
H  4.665002 3.730294 -0.6500
H  2.957579 3.308435 -0.895131
H  6.202326 -0.602351 -3.873461
H  5.573064 1.050241 -3.725023
H  7.204165 0.658858 -3.127733
elementType: S P O C H
totalener: -2950.72083501 hartree
nucrepener: 3275.79416031 hartree
electener: -6226.51499532 hartree
twoeener: 4355.96140868 hartree
cpcmener: -0.03814259 hartree
kineticenergy: 2942.55682973 hartree
xcener: -192.749990056015 hartree
chargesum: -0.0000000
charge: -0.027770 -0.449106 -0.439327 0.767474 0.726350 -0.328702 -0.352288 -0.346399 -0.346159 -0.340638 -0.330189 0.040431 0.051094 0.239298 0.235838 -0.158445 -0.149524 -0.158741 -0.176085 -0.162915 -0.167455 -0.181432 -0.181061 -0.116853 -0.114592 -0.113438 -0.112060 0.137600 0.137499 0.158689 0.157373 0.138316 0.152585 0.152739 0.169326 0.127110 0.111281 0.131202 0.130311 0.131247 0.112274 0.124158 0.120846 0.135347 0.128800 0.126836 0.109158
qa: -0.0278 -0.4491 -0.4393 0.7675 0.7263 -0.3287 -0.3523 -0.3464 -0.3462 -0.3406 -0.3302 0.0404 0.0511 0.2393 0.2358 -0.1584 -0.1495 -0.1587 -0.1761 -0.1629 -0.1675 -0.1814 -0.1811 -0.1169 -0.1146 -0.1134 -0.1121 0.1376 0.1375 0.1587 0.1574 0.1383 0.1526 0.1527 0.1693 0.1271 0.1113 0.1312 0.1303 0.1312 0.1123 0.1242 0.1208 0.1353 0.1288 0.1268 0.1092
va: 2.3951 1.9824 2.0177 5.4781 5.5155 2.1338 2.1100 2.1031 2.0832 2.0490 2.0978 3.7724 3.7582 3.7526 3.7346 3.9986 3.9737 3.9377 3.9626 3.9585 4.0325 3.9814 3.9976 3.8445 3.8333 3.8177 3.8402 1.0138 1.0127 0.9872 0.9900 1.0165 1.0033 1.0015 0.9855 0.9854 0.9991 0.9909 0.9889 0.9904 0.9996 0.9853 1.0047 0.9901 0.9894 0.9873 1.0001
dispcorr: -0.023324192 hartree
energy: -2950.744159201746
dipole: -8.59512 6.49472 -2.10040 7.63169 -6.76173 0.86995 -6.58149 5.06173 -1.51975
magnitude: 2.73462 au
magnitude: 6.95085 debye
