program: Orca
programVersion: 5.0.2
elementType: S S S P P O O O O O O C C C C C C C C C C C C C C C C H H H H H H H H H H H H H H H H H H H H
charge: 0
multiplicity: 1
keywords: wb97x-d3
keywords: def2-TZVPP
keywords: def2/J RIJCOSX
keywords: DEFGRID2
keywords: scfconv7
keywords: smallprint printgap noloewdin
keywords: NOSOSCF
formula: C16H20O6P2S3
InChI: InChI=1/C16H20O6P2S3/c1-17-23(25,18-2)21-13-5-9-15(10-6-13)27-16-11-7-14(8-12-16)22-24(26,19-3)20-4/h5-12H,1-4H3
47 atoms
S  0.097676 -3.546745 0.426424
S  -4.002575 1.637881 2.381414
S  3.563164 1.592954 -2.308648
P  -5.158654 1.005752 0.991452
P  5.013289 1.137805 -1.143105
O  -4.454796 0.177404 -0.205426
O  4.97834 -0.353806 -0.51847
O  -5.965285 2.092797 0.155313
O  -6.316653 -0.008485 1.399915
O  6.486047 1.17581 -1.746689
O  5.196477 1.995893 0.184711
C  -1.224405 -2.383397 0.252159
C  1.522865 -2.540427 0.133546
C  -3.391979 -0.681149 -0.013139
C  3.810914 -1.055654 -0.30372
C  -2.345292 -2.544564 1.05847
C  2.445487 -2.947536 -0.821636
C  -1.201849 -1.366004 -0.697701
C  1.75944 -1.387428 0.878015
C  -3.438997 -1.704022 0.919476
C  3.597237 -2.205871 -1.040654
C  -2.276498 -0.501963 -0.815728
C  2.897386 -0.633711 0.651546
C  -5.361485 3.341665 -0.208045
C  -7.151056 0.266944 2.533723
C  6.76794 0.602311 -3.029644
C  5.179213 3.428832 0.142567
H  -2.375004 -3.325236 1.807722
H  2.263877 -3.835991 -1.41179
H  -0.343868 -1.231425 -1.34296
H  1.052637 -1.067873 1.632592
H  -4.309552 -1.858058 1.542891
H  4.315906 -2.517283 -1.787326
H  -2.254365 0.29921 -1.543205
H  3.079467 0.260904 1.233149
H  -5.091686 3.916002 0.677454
H  -6.105797 3.8894 -0.779227
H  -4.477263 3.188793 -0.826444
H  -7.697548 1.201055 2.403804
H  -7.859849 -0.553319 2.603232
H  -6.561873 0.313455 3.449025
H  6.214389 1.115029 -3.815574
H  7.833692 0.729046 -3.198094
H  6.527735 -0.461003 -3.048738
H  5.267558 3.769434 1.170382
H  6.018613 3.813665 -0.436192
H  4.244712 3.796515 -0.280348
elementType: S P O C H
totalener: -2950.72168695 hartree
nucrepener: 3307.87835360 hartree
electener: -6258.60004055 hartree
twoeener: 4389.28888280 hartree
cpcmener: -0.03599925 hartree
kineticenergy: 2942.57945190 hartree
xcener: -192.752413887741 hartree
chargesum: -0.0000000
charge: -0.045027 -0.450040 -0.450194 0.767090 0.768594 -0.338215 -0.348668 -0.347232 -0.345303 -0.345035 -0.343359 0.042321 0.043156 0.217611 0.230120 -0.158616 -0.134393 -0.142761 -0.150356 -0.162103 -0.183752 -0.187399 -0.157905 -0.115925 -0.116937 -0.114721 -0.114656 0.136996 0.137852 0.151302 0.154130 0.154313 0.156195 0.153192 0.155627 0.113523 0.131135 0.127819 0.129323 0.131259 0.112766 0.111585 0.131315 0.126219 0.130692 0.128087 0.110378
qa: -0.0450 -0.4500 -0.4502 0.7671 0.7686 -0.3382 -0.3487 -0.3472 -0.3453 -0.3450 -0.3434 0.0423 0.0432 0.2176 0.2301 -0.1586 -0.1344 -0.1428 -0.1504 -0.1621 -0.1838 -0.1874 -0.1579 -0.1159 -0.1169 -0.1147 -0.1147 0.1370 0.1379 0.1513 0.1541 0.1543 0.1562 0.1532 0.1556 0.1135 0.1311 0.1278 0.1293 0.1313 0.1128 0.1116 0.1313 0.1262 0.1307 0.1281 0.1104
va: 2.3543 1.9826 1.9830 5.4737 5.4777 2.1178 2.1047 2.0964 2.0920 2.0980 2.1007 3.7568 3.7123 3.7422 3.7129 3.9917 3.9794 3.9062 3.9588 3.9735 4.0334 4.0076 3.9746 3.8382 3.8365 3.8451 3.8388 1.0134 1.0131 0.9920 0.9928 1.0080 0.9946 0.9995 1.0058 0.9995 0.9915 0.9849 0.9890 0.9907 0.9991 0.9994 0.9909 0.9843 0.9898 0.9881 0.9998
dispcorr: -0.023414295 hartree
energy: -2950.745101247825
dipole: -0.18192 0.42755 0.24562 8.86062 -7.85961 1.00101 -1.47568 1.05518 -0.42050
magnitude: 1.11318 au
magnitude: 2.82947 debye
