program: Orca
programVersion: 5.0.2
elementType: S S S P P O O O O O O C C C C C C C C C C C C C C C C H H H H H H H H H H H H H H H H H H H H
charge: 0
multiplicity: 1
keywords: wb97x-d3
keywords: def2-TZVPP
keywords: def2/J RIJCOSX
keywords: DEFGRID2
keywords: scfconv7
keywords: smallprint printgap noloewdin
keywords: NOSOSCF
formula: C16H20O6P2S3
InChI: InChI=1/C16H20O6P2S3/c1-17-23(25,18-2)21-13-5-9-15(10-6-13)27-16-11-7-14(8-12-16)22-24(26,19-3)20-4/h5-12H,1-4H3
47 atoms
S  0.160657 -2.376723 1.39492
S  -5.804168 1.677414 1.822437
S  6.792787 -0.417267 0.400249
P  -6.141741 0.626264 0.258223
P  6.030846 0.619878 -1.017485
O  -4.853696 0.093605 -0.557963
O  4.460016 0.98122 -0.881826
O  -6.941695 1.32347 -0.927436
O  -6.949152 -0.73186 0.442756
O  6.631464 2.071316 -1.273143
O  6.060567 -0.00063 -2.483118
C  -1.31049 -1.576062 0.817477
C  1.439805 -1.369271 0.701176
C  -3.707025 -0.462147 -0.038959
C  3.495242 0.156351 -0.351779
C  -2.45529 -1.677605 1.599726
C  2.351588 -1.936605 -0.179544
C  -1.378224 -0.914383 -0.4054
C  1.569335 -0.029443 1.05906
C  -3.65986 -1.137215 1.171172
C  3.388473 -1.178717 -0.706016
C  -2.567762 -0.344066 -0.822711
C  2.592834 0.73565 0.530048
C  -6.694215 2.686609 -1.291672
C  -8.052115 -0.828637 1.353552
C  6.930284 2.952278 -0.182797
C  7.225286 -0.678145 -2.972495
H  -2.421852 -2.182683 2.556751
H  2.254296 -2.973672 -0.472055
H  -0.505573 -0.831726 -1.039758
H  0.870473 0.421252 1.751605
H  -4.53493 -1.253785 1.795744
H  4.076264 -1.633327 -1.406331
H  -2.615269 0.17802 -1.76962
H  2.694651 1.77815 0.802384
H  -7.399969 2.928012 -2.081508
H  -5.678617 2.815287 -1.665405
H  -6.859025 3.352802 -0.445452
H  -7.743828 -0.581319 2.368709
H  -8.870574 -0.176236 1.050758
H  -8.387168 -1.861676 1.321932
H  6.031313 3.198139 0.382578
H  7.671217 2.51191 0.483534
H  7.335118 3.860245 -0.621006
H  7.495787 -1.510201 -2.323113
H  6.970072 -1.058925 -3.957438
H  8.069211 0.005879 -3.059951
elementType: S P O C H
totalener: -2950.72061533 hartree
nucrepener: 3225.05216535 hartree
electener: -6175.77278068 hartree
twoeener: 4306.01342067 hartree
cpcmener: -0.03567800 hartree
kineticenergy: 2942.54992476 hartree
xcener: -192.750928357819 hartree
chargesum: 0.0000000
charge: -0.051650 -0.450409 -0.446964 0.762548 0.762926 -0.318811 -0.331235 -0.347222 -0.344973 -0.344726 -0.345135 0.037652 0.041066 0.250668 0.235302 -0.166819 -0.148830 -0.147850 -0.138326 -0.166204 -0.161566 -0.201043 -0.176026 -0.117226 -0.113322 -0.115843 -0.115977 0.135760 0.139335 0.154407 0.153097 0.132558 0.149603 0.151393 0.154133 0.130908 0.127808 0.111199 0.112009 0.131316 0.131011 0.127201 0.111373 0.131509 0.112020 0.131366 0.131988
qa: -0.0517 -0.4504 -0.4470 0.7625 0.7629 -0.3188 -0.3312 -0.3472 -0.3450 -0.3447 -0.3451 0.0377 0.0411 0.2507 0.2353 -0.1668 -0.1488 -0.1478 -0.1383 -0.1662 -0.1616 -0.2010 -0.1760 -0.1172 -0.1133 -0.1158 -0.1160 0.1358 0.1393 0.1544 0.1531 0.1326 0.1496 0.1514 0.1541 0.1309 0.1278 0.1112 0.1120 0.1313 0.1310 0.1272 0.1114 0.1315 0.1120 0.1314 0.1320
va: 2.3433 1.9830 1.9860 5.4882 5.4820 2.1517 2.1264 2.1029 2.0794 2.1021 2.0874 3.7886 3.7225 3.7428 3.7548 3.9981 4.0235 3.9100 3.9487 3.9573 3.9649 3.9953 3.9835 3.8417 3.8312 3.8418 3.8318 1.0130 1.0146 0.9891 0.9937 1.0198 1.0096 1.0034 0.9991 0.9905 0.9856 0.9993 0.9993 0.9886 0.9905 0.9853 0.9994 0.9904 1.0002 0.9906 0.9883
dispcorr: -0.022736621 hartree
energy: -2950.743351953751
dipole: -1.27854 1.04183 -0.23672 5.44272 -4.49782 0.94489 -5.39481 3.93904 -1.45577
magnitude: 1.75161 au
magnitude: 4.45223 debye
