program: Orca
programVersion: 5.0.2
elementType: S S S P P O O O O O O C C C C C C C C C C C C C C C C H H H H H H H H H H H H H H H H H H H H
charge: 0
multiplicity: 1
keywords: wb97x-d3
keywords: def2-TZVPP
keywords: def2/J RIJCOSX
keywords: DEFGRID2
keywords: scfconv7
keywords: smallprint printgap noloewdin
keywords: NOSOSCF
formula: C16H20O6P2S3
InChI: InChI=1/C16H20O6P2S3/c1-17-23(25,18-2)21-13-5-9-15(10-6-13)27-16-11-7-14(8-12-16)22-24(26,19-3)20-4/h5-12H,1-4H3
47 atoms
S  -0.028014 -3.234884 -0.551962
S  -4.025716 2.200233 0.747508
S  6.180229 2.800077 -1.098432
P  -5.419584 0.886953 0.758873
P  5.55919 1.085925 -0.516942
O  -5.001746 -0.59185 1.265201
O  3.975037 1.109465 -0.215352
O  -6.10265 0.535015 -0.634989
O  -6.684002 1.166511 1.683615
O  5.809983 -0.156531 -1.484643
O  6.124377 0.530938 0.864372
C  -1.49465 -2.40235 -0.008667
C  1.170015 -1.934711 -0.450109
C  -3.830483 -1.187638 0.830213
C  3.096478 0.048471 -0.306457
C  -1.503437 -1.633014 1.152789
C  0.937828 -0.692043 -1.034426
C  -2.667296 -2.570672 -0.734506
C  2.378461 -2.176853 0.189374
C  -2.668443 -1.010919 1.566092
C  1.896371 0.301109 -0.957123
C  -3.844304 -1.967499 -0.312352
C  3.352213 -1.189198 0.259072
C  -6.508884 1.577368 -1.532423
C  -6.531445 1.740595 2.988446
C  5.639044 -0.043943 -2.903952
C  7.536887 0.503425 1.113416
H  -0.599261 -1.50577 1.733734
H  0.007123 -0.491522 -1.549046
H  -2.669014 -3.161533 -1.641059
H  2.567443 -3.134783 0.655846
H  -2.676523 -0.406247 2.463042
H  1.714798 1.27068 -1.402403
H  -4.757231 -2.102196 -0.877196
H  4.274195 -1.393498 0.785669
H  -7.267759 2.213597 -1.07765
H  -6.930289 1.087086 -2.405418
H  -5.656624 2.18481 -1.83529
H  -7.531737 1.844091 3.399442
H  -5.942912 1.092567 3.637829
H  -6.061284 2.72161 2.92979
H  6.281114 0.73557 -3.312802
H  5.923561 -1.003333 -3.326648
H  4.601061 0.167747 -3.160816
H  8.031649 -0.225281 0.472006
H  7.98042 1.486828 0.957324
H  7.664237 0.213613 2.152456
elementType: S P O C H
totalener: -2950.71991486 hartree
nucrepener: 3283.73669304 hartree
electener: -6234.45660790 hartree
twoeener: 4364.57487345 hartree
cpcmener: -0.03574394 hartree
kineticenergy: 2942.56216488 hartree
xcener: -192.748210490318 hartree
chargesum: -0.0000000
charge: -0.055505 -0.453106 -0.440113 0.777240 0.723262 -0.359538 -0.333267 -0.344564 -0.343375 -0.329645 -0.333134 0.027898 0.030731 0.259977 0.216463 -0.121515 -0.122602 -0.144757 -0.159222 -0.203842 -0.187806 -0.178619 -0.155227 -0.117978 -0.113908 -0.106440 -0.109139 0.153448 0.152548 0.137448 0.138571 0.150783 0.150899 0.155674 0.155797 0.127706 0.129828 0.112812 0.131507 0.127917 0.112568 0.114321 0.132183 0.127665 0.127071 0.108982 0.130002
qa: -0.0555 -0.4531 -0.4401 0.7772 0.7233 -0.3595 -0.3333 -0.3446 -0.3434 -0.3296 -0.3331 0.0279 0.0307 0.2600 0.2165 -0.1215 -0.1226 -0.1448 -0.1592 -0.2038 -0.1878 -0.1786 -0.1552 -0.1180 -0.1139 -0.1064 -0.1091 0.1534 0.1525 0.1374 0.1386 0.1508 0.1509 0.1557 0.1558 0.1277 0.1298 0.1128 0.1315 0.1279 0.1126 0.1143 0.1322 0.1277 0.1271 0.1090 0.1300
va: 2.3228 1.9859 2.0270 5.4852 5.5102 2.0964 2.1212 2.1116 2.0958 2.0553 2.0890 3.7305 3.7289 3.6922 3.7597 3.9009 3.9111 3.9798 4.0236 4.0143 3.9912 4.0587 3.9502 3.8448 3.8356 3.8277 3.8310 0.9900 0.9909 1.0134 1.0144 1.0045 1.0036 1.0038 1.0130 0.9865 0.9902 0.9988 0.9912 0.9850 1.0000 1.0050 0.9908 0.9814 0.9884 1.0034 0.9897
dispcorr: -0.023565105 hartree
energy: -2950.743479962583
dipole: -1.37288 0.68815 -0.68474 -0.60815 -0.53953 -1.14768 -1.44980 1.28911 -0.16069
magnitude: 1.34605 au
magnitude: 3.42139 debye
