program: Orca
programVersion: 5.0.2
elementType: S S S P P O O O O O O C C C C C C C C C C C C C C C C H H H H H H H H H H H H H H H H H H H H
charge: 0
multiplicity: 1
keywords: wb97x-d3
keywords: def2-TZVPP
keywords: def2/J RIJCOSX
keywords: DEFGRID2
keywords: scfconv7
keywords: smallprint printgap noloewdin
keywords: NOSOSCF
formula: C16H20O6P2S3
InChI: InChI=1/C16H20O6P2S3/c1-17-23(25,18-2)21-13-5-9-15(10-6-13)27-16-11-7-14(8-12-16)22-24(26,19-3)20-4/h5-12H,1-4H3
47 atoms
S  -0.131254 -3.375951 -0.100068
S  -5.190553 1.60987 -1.547832
S  3.876105 2.121928 -0.938623
P  -5.352339 1.145194 0.301158
P  5.311617 0.987204 -0.373514
O  -3.991121 0.935119 1.149069
O  5.071712 -0.603973 -0.540577
O  -6.08883 -0.233543 0.627166
O  -6.060564 2.286224 1.148698
O  6.711653 1.146678 -1.111894
O  5.748868 1.047119 1.155374
C  -1.249682 -2.052641 0.269922
C  1.4100 -2.512188 -0.218773
C  -3.094057 -0.070617 0.834416
C  3.842385 -1.213002 -0.41413
C  -2.253452 -2.277866 1.20574
C  2.171129 -2.629224 -1.374879
C  -1.175369 -0.823734 -0.380371
C  1.884361 -1.752745 0.847323
C  -3.187416 -1.290284 1.481836
C  3.394158 -1.98115 -1.473964
C  -2.092103 0.173472 -0.092461
C  3.095824 -1.092252 0.750116
C  -7.241844 -0.653967 -0.112356
C  -6.23483 2.192008 2.573395
C  6.782834 1.347623 -2.529008
C  6.004067 2.30051 1.802472
H  -2.309825 -3.222388 1.731048
H  1.808638 -3.211675 -2.211548
H  -0.401774 -0.634337 -1.113072
H  1.307056 -1.66951 1.758792
H  -3.961277 -1.465529 2.217212
H  3.98726 -2.064839 -2.375312
H  -2.025463 1.133483 -0.586625
H  3.460408 -0.510953 1.586944
H  -7.519384 -1.629372 0.277312
H  -7.013439 -0.739999 -1.174122
H  -8.072406 0.037604 0.026626
H  -6.582266 1.204947 2.87639
H  -5.30487 2.427242 3.0885
H  -6.987989 2.927759 2.841224
H  6.310257 0.528128 -3.070419
H  6.314549 2.289642 -2.811581
H  7.838728 1.379675 -2.783086
H  6.229861 2.072157 2.840387
H  6.857673 2.806971 1.352771
H  5.1296 2.949195 1.758809
elementType: S P O C H
totalener: -2950.72141000 hartree
nucrepener: 3296.75930824 hartree
electener: -6247.48071823 hartree
twoeener: 4378.11456488 hartree
cpcmener: -0.03820893 hartree
kineticenergy: 2942.56185914 hartree
xcener: -192.748159201546 hartree
chargesum: -0.0000000
charge: -0.056877 -0.438957 -0.449127 0.733352 0.766322 -0.357365 -0.339008 -0.332519 -0.342104 -0.345705 -0.342792 0.029422 0.035185 0.273013 0.232828 -0.140724 -0.132941 -0.127444 -0.135318 -0.190974 -0.185439 -0.208773 -0.168823 -0.109451 -0.110771 -0.115420 -0.113204 0.137252 0.137787 0.152092 0.151189 0.153320 0.154016 0.150170 0.156046 0.127924 0.113801 0.129103 0.121886 0.120459 0.128724 0.126285 0.113410 0.131318 0.130489 0.128410 0.109935
qa: -0.0569 -0.4390 -0.4491 0.7334 0.7663 -0.3574 -0.3390 -0.3325 -0.3421 -0.3457 -0.3428 0.0294 0.0352 0.2730 0.2328 -0.1407 -0.1329 -0.1274 -0.1353 -0.1910 -0.1854 -0.2088 -0.1688 -0.1095 -0.1108 -0.1154 -0.1132 0.1373 0.1378 0.1521 0.1512 0.1533 0.1540 0.1502 0.1560 0.1279 0.1138 0.1291 0.1219 0.1205 0.1287 0.1263 0.1134 0.1313 0.1305 0.1284 0.1099
va: 2.3221 2.0235 1.9838 5.5183 5.4762 2.0800 2.1144 2.0606 2.0996 2.0972 2.0980 3.7569 3.7082 3.6834 3.7263 3.9596 3.9747 3.9050 3.9583 4.0511 4.0288 4.0469 3.9633 3.8312 3.8426 3.8413 3.8373 1.0124 1.0128 0.9904 0.9946 1.0024 0.9975 1.0078 1.0077 0.9912 1.0025 0.9852 0.9921 0.9910 0.9898 0.9849 0.9992 0.9913 0.9898 0.9889 1.0002
dispcorr: -0.023647703 hartree
energy: -2950.745057701897
dipole: -0.72012 1.02339 0.30327 2.21439 -2.63817 -0.42378 6.09242 -4.29709 1.79533
magnitude: 1.86943 au
magnitude: 4.75172 debye
