program: Orca
programVersion: 5.0.2
elementType: S S S P P O O O O O O C C C C C C C C C C C C C C C C H H H H H H H H H H H H H H H H H H H H
charge: 0
multiplicity: 1
keywords: wb97x-d3
keywords: def2-TZVPP
keywords: def2/J RIJCOSX
keywords: DEFGRID2
keywords: scfconv7
keywords: smallprint printgap noloewdin
keywords: NOSOSCF
formula: C16H20O6P2S3
InChI: InChI=1/C16H20O6P2S3/c1-17-23(25,18-2)21-13-5-9-15(10-6-13)27-16-11-7-14(8-12-16)22-24(26,19-3)20-4/h5-12H,1-4H3
47 atoms
S  0.103181 -3.762907 0.09474
S  -4.020379 1.34906 -1.33584
S  3.20372 2.492476 -0.033032
P  -4.825483 1.112595 0.386173
P  4.678625 1.360694 -0.484563
O  -4.611118 -0.332372 1.08105
O  4.367249 0.05834 -1.392071
O  -6.408476 1.255147 0.485265
O  -4.343038 2.068838 1.563144
O  5.766616 2.103673 -1.371014
O  5.444171 0.662088 0.733621
C  -1.282748 -2.699728 0.383517
C  1.355894 -2.592535 -0.348784
C  -3.490797 -1.104874 0.845186
C  3.367588 -0.827903 -1.035527
C  -2.508724 -3.026047 -0.183872
C  2.63483 -2.757161 0.169724
C  -1.174074 -1.576073 1.199299
C  1.097545 -1.550821 -1.236754
C  -3.620258 -2.229956 0.051299
C  3.649838 -1.878297 -0.180509
C  -2.27469 -0.767314 1.420392
C  2.098772 -0.655575 -1.567593
C  -7.256249 0.656246 -0.503545
C  -4.228297 3.484103 1.36525
C  6.972341 1.463341 -1.821992
C  5.789711 1.417078 1.902533
H  -2.600417 -3.891536 -0.827061
H  2.846674 -3.561914 0.861559
H  -0.228024 -1.320657 1.658616
H  0.11119 -1.422448 -1.662797
H  -4.575015 -2.477187 -0.394471
H  4.64588 -2.012579 0.21955
H  -2.188368 0.107898 2.051463
H  1.898496 0.161575 -2.247633
H  -7.098023 -0.421125 -0.561257
H  -7.085652 1.10296 -1.482418
H  -8.279538 0.84898 -0.192303
H  -5.189474 3.925776 1.10297
H  -3.890306 3.900705 2.309992
H  -3.498119 3.711008 0.589081
H  7.478446 0.94005 -1.011745
H  6.758821 0.768272 -2.63274
H  7.620868 2.253453 -2.190648
H  4.895416 1.774331 2.411856
H  6.333001 0.741755 2.558014
H  6.429955 2.263284 1.652137
elementType: S P O C H
totalener: -2950.72156465 hartree
nucrepener: 3350.50882246 hartree
electener: -6301.23038711 hartree
twoeener: 4432.20369533 hartree
cpcmener: -0.03847484 hartree
kineticenergy: 2942.56141373 hartree
xcener: -192.747045617786 hartree
chargesum: -0.0000000
charge: -0.047043 -0.452496 -0.436827 0.773466 0.737857 -0.354378 -0.356975 -0.345772 -0.344229 -0.343278 -0.336888 0.040683 0.025542 0.232346 0.266444 -0.139064 -0.140217 -0.144067 -0.120794 -0.185413 -0.184036 -0.167984 -0.211035 -0.115289 -0.116376 -0.112284 -0.113457 0.138037 0.137639 0.154678 0.151778 0.156658 0.156173 0.158256 0.150004 0.125902 0.112450 0.131797 0.127806 0.130630 0.112045 0.122299 0.123176 0.128893 0.115842 0.128924 0.128579
qa: -0.0470 -0.4525 -0.4368 0.7735 0.7379 -0.3544 -0.3570 -0.3458 -0.3442 -0.3433 -0.3369 0.0407 0.0255 0.2323 0.2664 -0.1391 -0.1402 -0.1441 -0.1208 -0.1854 -0.1840 -0.1680 -0.2110 -0.1153 -0.1164 -0.1123 -0.1135 0.1380 0.1376 0.1547 0.1518 0.1567 0.1562 0.1583 0.1500 0.1259 0.1124 0.1318 0.1278 0.1306 0.1120 0.1223 0.1232 0.1289 0.1158 0.1289 0.1286
va: 2.3428 1.9808 2.0236 5.4747 5.5149 2.0990 2.0829 2.0954 2.1029 2.1004 2.0595 3.7137 3.7420 3.7014 3.6842 3.9729 3.9734 3.9372 3.8891 4.0367 4.0569 4.0024 4.0306 3.8443 3.8414 3.8397 3.8346 1.0127 1.0126 0.9911 0.9919 0.9934 1.0043 1.0046 1.0057 0.9843 0.9992 0.9913 0.9872 0.9905 0.9987 0.9916 0.9910 0.9891 1.0019 0.9913 0.9847
dispcorr: -0.024025030 hartree
energy: -2950.745589684895
dipole: 4.48721 -3.37950 1.10771 4.67408 -4.83911 -0.16503 2.89199 -2.18456 0.70743
magnitude: 1.32465 au
magnitude: 3.36700 debye
