program: Orca
programVersion: 5.0.2
elementType: S S S P P O O O O O O C C C C C C C C C C C C C C C C H H H H H H H H H H H H H H H H H H H H
charge: 0
multiplicity: 1
keywords: wb97x-d3
keywords: def2-TZVPP
keywords: def2/J RIJCOSX
keywords: DEFGRID2
keywords: scfconv7
keywords: smallprint printgap noloewdin
keywords: NOSOSCF
formula: C16H20O6P2S3
InChI: InChI=1/C16H20O6P2S3/c1-17-23(25,18-2)21-13-5-9-15(10-6-13)27-16-11-7-14(8-12-16)22-24(26,19-3)20-4/h5-12H,1-4H3
47 atoms
S  0.003383 -3.439638 -0.975147
S  -5.338668 1.080239 -1.416927
S  3.423493 2.239474 0.25213
P  -5.112311 1.170939 0.482377
P  5.004717 1.217952 -0.080339
O  -4.366101 -0.082654 1.179922
O  4.894007 -0.364548 0.284622
O  -6.42985 1.251574 1.371564
O  -4.25098 2.371415 1.074442
O  5.46791 1.289406 -1.595527
O  6.337806 1.584917 0.707021
C  -1.275745 -2.387608 -0.346714
C  1.456244 -2.505955 -0.584557
C  -3.341981 -0.81342 0.619583
C  3.751517 -1.077626 -0.017169
C  -1.24962 -1.007853 -0.527413
C  1.684988 -2.038071 0.707636
C  -2.353485 -2.972624 0.308175
C  2.396423 -2.274808 -1.580732
C  -2.270807 -0.215459 -0.030892
C  2.824231 -1.30606 0.988771
C  -3.396484 -2.188072 0.77574
C  3.555248 -1.564879 -1.297522
C  -7.595828 0.488399 1.037052
C  -4.409505 3.711893 0.593097
C  6.656181 0.639589 -2.077756
C  6.352135 1.665999 2.137852
H  -0.424321 -0.5360 -1.044362
H  0.965876 -2.226794 1.493958
H  -2.384082 -4.043063 0.464545
H  2.225127 -2.632952 -2.587326
H  -2.213129 0.858027 -0.152531
H  2.998983 -0.925508 1.986466
H  -4.236164 -2.643975 1.28381
H  4.288833 -1.389981 -2.074078
H  -7.969124 0.759245 0.050048
H  -8.347055 0.729139 1.783935
H  -7.389273 -0.581306 1.06767
H  -3.644327 4.308212 1.082261
H  -4.268078 3.760341 -0.486165
H  -5.391967 4.106098 0.85143
H  6.772524 -0.362041 -1.665405
H  6.550774 0.564773 -3.156483
H  7.535743 1.236238 -1.842129
H  5.576386 2.341485 2.49899
H  6.216215 0.682164 2.585927
H  7.325883 2.057012 2.418641
elementType: S P O C H
totalener: -2950.72175842 hartree
nucrepener: 3317.94979589 hartree
electener: -6268.67155430 hartree
twoeener: 4399.29760458 hartree
cpcmener: -0.03916104 hartree
kineticenergy: 2942.56057276 hartree
xcener: -192.749379423037 hartree
chargesum: -0.0000000
charge: -0.051267 -0.448994 -0.435203 0.766246 0.738076 -0.331704 -0.358880 -0.346626 -0.344943 -0.349029 -0.336594 0.034614 0.046038 0.230297 0.250145 -0.158530 -0.133339 -0.141681 -0.150301 -0.156810 -0.190686 -0.184240 -0.165753 -0.116617 -0.115293 -0.125375 -0.105433 0.151413 0.152720 0.137485 0.136875 0.144718 0.150309 0.151546 0.164330 0.111937 0.131332 0.127321 0.131191 0.111142 0.131310 0.123586 0.131499 0.130344 0.105375 0.126581 0.130869
qa: -0.0513 -0.4490 -0.4352 0.7662 0.7381 -0.3317 -0.3589 -0.3466 -0.3449 -0.3490 -0.3366 0.0346 0.0460 0.2303 0.2501 -0.1585 -0.1333 -0.1417 -0.1503 -0.1568 -0.1907 -0.1842 -0.1658 -0.1166 -0.1153 -0.1254 -0.1054 0.1514 0.1527 0.1375 0.1369 0.1447 0.1503 0.1515 0.1643 0.1119 0.1313 0.1273 0.1312 0.1111 0.1313 0.1236 0.1315 0.1303 0.1054 0.1266 0.1309
va: 2.3375 1.9833 2.0164 5.4775 5.5077 2.1269 2.0472 2.0995 2.0870 2.1020 2.0890 3.7452 3.6995 3.7450 3.7036 3.9533 3.9166 3.9737 4.0118 3.9405 4.0240 4.0131 4.0319 3.8414 3.8326 3.8351 3.8345 0.9940 0.9912 1.0115 1.0152 1.0134 1.0001 1.0003 0.9868 0.9995 0.9910 0.9851 0.9899 1.0007 0.9886 0.9903 0.9883 0.9939 1.0017 0.9895 0.9891
dispcorr: -0.023947363 hartree
energy: -2950.745705782135
dipole: 4.12495 -2.77976 1.34519 3.39944 -3.71569 -0.31625 3.83327 -2.74157 1.09169
magnitude: 1.76106 au
magnitude: 4.47626 debye
