program: Orca
programVersion: 5.0.2
elementType: S S S P P O O O O O O C C C C C C C C C C C C C C C C H H H H H H H H H H H H H H H H H H H H
charge: 0
multiplicity: 1
keywords: wb97x-d3
keywords: def2-TZVPP
keywords: def2/J RIJCOSX
keywords: DEFGRID2
keywords: scfconv7
keywords: smallprint printgap noloewdin
keywords: NOSOSCF
formula: C16H20O6P2S3
InChI: InChI=1/C16H20O6P2S3/c1-17-23(25,18-2)21-13-5-9-15(10-6-13)27-16-11-7-14(8-12-16)22-24(26,19-3)20-4/h5-12H,1-4H3
47 atoms
S  -0.322546 -3.133035 -1.031168
S  -4.923106 2.333516 -0.641958
S  4.876947 1.333094 -2.19081
P  -5.355291 1.232552 0.866889
P  5.336163 0.76208 -0.420552
O  -4.118462 0.533679 1.640051
O  5.020691 -0.784659 -0.060138
O  -6.280167 -0.033098 0.594864
O  -6.089478 1.939929 2.089495
O  6.868976 0.842005 -0.001956
O  4.617296 1.500828 0.792393
C  -1.429125 -2.002181 -0.238992
C  1.257977 -2.402866 -0.716192
C  -3.240812 -0.305241 0.975642
C  3.765183 -1.321657 -0.286524
C  -1.27416 -0.622378 -0.346098
C  1.594339 -1.896142 0.536546
C  -2.505608 -2.522749 0.470221
C  2.197209 -2.388851 -1.740942
C  -2.170834 0.229815 0.274669
C  2.841214 -1.333971 0.747203
C  -3.4269 -1.673029 1.065083
C  3.460628 -1.857568 -1.525256
C  -7.336448 0.014609 -0.37458
C  -5.662703 3.221326 2.570954
C  7.902703 0.410365 -0.896727
C  4.392169 2.917361 0.768172
H  -0.446293 -0.202268 -0.901591
H  0.881667 -1.91977 1.350457
H  -2.630005 -3.593159 0.570546
H  1.946228 -2.777459 -2.719515
H  -2.036648 1.301075 0.212592
H  3.097061 -0.927924 1.716969
H  -4.26284 -2.079028 1.619016
H  4.191731 -1.850232 -2.322107
H  -6.949151 0.261983 -1.362257
H  -8.098216 0.739654 -0.089344
H  -7.777734 -0.977656 -0.398028
H  -4.657989 3.165937 2.990083
H  -5.686952 3.966247 1.775595
H  -6.36198 3.505603 3.352498
H  7.828408 -0.65897 -1.093886
H  7.8606 0.959294 -1.83728
H  8.846888 0.617454 -0.4012
H  3.838444 3.15625 1.671792
H  5.335143 3.4636 0.769317
H  3.803783 3.205379 -0.10243
elementType: S P O C H
totalener: -2950.72035067 hartree
nucrepener: 3295.40196721 hartree
electener: -6246.12231788 hartree
twoeener: 4376.60495239 hartree
cpcmener: -0.03350755 hartree
kineticenergy: 2942.57245674 hartree
xcener: -192.751010643141 hartree
chargesum: 0.0000000
charge: -0.036588 -0.454470 -0.453452 0.775879 0.777496 -0.358162 -0.359987 -0.344930 -0.342899 -0.342377 -0.345568 0.034041 0.031704 0.267515 0.263475 -0.150465 -0.150980 -0.134766 -0.130383 -0.191817 -0.186103 -0.196522 -0.196367 -0.114764 -0.112861 -0.112363 -0.115943 0.157336 0.156475 0.138387 0.138573 0.150382 0.155297 0.153631 0.147850 0.114478 0.129013 0.129101 0.129027 0.109515 0.131256 0.128262 0.109889 0.131268 0.129632 0.129359 0.112932
qa: -0.0366 -0.4545 -0.4535 0.7759 0.7775 -0.3582 -0.3600 -0.3449 -0.3429 -0.3424 -0.3456 0.0340 0.0317 0.2675 0.2635 -0.1505 -0.1510 -0.1348 -0.1304 -0.1918 -0.1861 -0.1965 -0.1964 -0.1148 -0.1129 -0.1124 -0.1159 0.1573 0.1565 0.1384 0.1386 0.1504 0.1553 0.1536 0.1478 0.1145 0.1290 0.1291 0.1290 0.1095 0.1313 0.1283 0.1099 0.1313 0.1296 0.1294 0.1129
va: 2.3713 1.9871 1.9880 5.4854 5.4857 2.0986 2.0964 2.1068 2.0983 2.0991 2.1088 3.7572 3.7481 3.6933 3.6951 3.9274 3.9187 3.9685 3.9671 4.0192 4.0363 4.0677 4.0351 3.8387 3.8344 3.8353 3.8408 0.9887 0.9884 1.0112 1.0117 1.0097 1.0041 1.0036 1.0077 0.9992 0.9858 0.9913 0.9856 1.0011 0.9901 0.9859 1.0007 0.9904 0.9907 0.9857 0.9998
dispcorr: -0.023047960 hartree
energy: -2950.743398634390
dipole: -0.84258 0.84193 -0.00065 6.53791 -6.07794 0.45997 4.61728 -3.18488 1.43240
magnitude: 1.50444 au
magnitude: 3.82398 debye
