program: Orca
programVersion: 5.0.2
elementType: S S S P P O O O O O O C C C C C C C C C C C C C C C C H H H H H H H H H H H H H H H H H H H H
charge: 0
multiplicity: 1
keywords: wb97x-d3
keywords: def2-TZVPP
keywords: def2/J RIJCOSX
keywords: DEFGRID2
keywords: scfconv7
keywords: smallprint printgap noloewdin
keywords: NOSOSCF
formula: C16H20O6P2S3
InChI: InChI=1/C16H20O6P2S3/c1-17-23(25,18-2)21-13-5-9-15(10-6-13)27-16-11-7-14(8-12-16)22-24(26,19-3)20-4/h5-12H,1-4H3
47 atoms
S  0.003941 -3.108723 0.002969
S  -5.066452 1.249036 -1.726592
S  5.061673 1.263739 1.723736
P  -5.75172 0.86217 0.019239
P  5.750339 0.874337 -0.020192
O  -4.683482 0.324971 1.109518
O  4.684583 0.332025 -1.110377
O  -6.874571 -0.259983 0.148477
O  -6.41466 2.069163 0.818518
O  6.411696 2.080765 -0.821472
O  6.875942 -0.245519 -0.145606
C  -1.359107 -2.020606 0.29449
C  1.364891 -2.018659 -0.291127
C  -3.598269 -0.468783 0.802081
C  3.600996 -0.463505 -0.801838
C  -2.604167 -2.403071 -0.192233
C  1.250413 -0.857748 -1.051451
C  -1.246569 -0.856929 1.050877
C  2.61041 -2.396852 0.197767
C  -3.73072 -1.638908 0.073174
C  2.363217 -0.068594 -1.286588
C  -2.36094 -0.069526 1.284455
C  3.735496 -1.631073 -0.069197
C  -7.9673 -0.306516 -0.779103
C  -5.831975 3.378897 0.785238
C  5.82704 3.389648 -0.792455
C  7.967211 -0.288128 0.783843
H  -2.707722 -3.301723 -0.786508
H  0.293545 -0.553049 -1.454285
H  -0.290062 -0.548825 1.451982
H  2.71543 -3.293314 0.79509
H  -4.693415 -1.967787 -0.295077
H  2.271594 0.842891 -1.862851
H  -2.27086 0.843904 1.857882
H  4.698585 -1.956563 0.301041
H  -8.569935 -1.167389 -0.503824
H  -7.606982 -0.430309 -1.79997
H  -8.577366 0.594074 -0.714151
H  -5.824084 3.775456 -0.229386
H  -6.454562 4.009416 1.413721
H  -4.816461 3.370386 1.180926
H  6.450745 4.019885 -1.420113
H  4.812816 3.378887 -1.19137
H  5.815322 3.788117 0.221387
H  7.605383 -0.406967 1.804783
H  8.569999 -1.150464 0.513532
H  8.577587 0.612007 0.715534
elementType: S P O C H
totalener: -2950.72128789 hartree
nucrepener: 3260.30707823 hartree
electener: -6211.02836612 hartree
twoeener: 4341.41651615 hartree
cpcmener: -0.03588401 hartree
kineticenergy: 2942.54852131 hartree
xcener: -192.749456216280 hartree
chargesum: 0.0000000
charge: -0.026105 -0.449797 -0.449780 0.768818 0.768804 -0.338339 -0.338347 -0.346648 -0.347051 -0.346996 -0.346647 0.054371 0.054558 0.214803 0.214905 -0.159271 -0.169019 -0.168823 -0.159267 -0.156436 -0.170732 -0.170788 -0.156447 -0.115921 -0.115946 -0.115927 -0.115853 0.137760 0.157631 0.157594 0.137728 0.150337 0.153579 0.153572 0.150355 0.131386 0.112451 0.130264 0.112131 0.130958 0.127526 0.130950 0.127537 0.112088 0.112383 0.131352 0.130296
qa: -0.0261 -0.4498 -0.4498 0.7688 0.7688 -0.3383 -0.3383 -0.3466 -0.3471 -0.3470 -0.3466 0.0544 0.0546 0.2148 0.2149 -0.1593 -0.1690 -0.1688 -0.1593 -0.1564 -0.1707 -0.1708 -0.1564 -0.1159 -0.1159 -0.1159 -0.1159 0.1378 0.1576 0.1576 0.1377 0.1503 0.1536 0.1536 0.1504 0.1314 0.1125 0.1303 0.1121 0.1310 0.1275 0.1309 0.1275 0.1121 0.1124 0.1314 0.1303
va: 2.4007 1.9823 1.9823 5.4722 5.4723 2.1171 2.1172 2.0895 2.0985 2.0987 2.0894 3.7554 3.7551 3.7533 3.7534 3.9985 3.9371 3.9369 3.9985 3.9682 3.9897 3.9897 3.9678 3.8339 3.8413 3.8413 3.8338 1.0135 0.9883 0.9883 1.0135 1.0083 0.9994 0.9994 1.0083 0.9906 0.9999 0.9888 0.9998 0.9914 0.9848 0.9913 0.9848 0.9999 0.9999 0.9905 0.9888
dispcorr: -0.022975868 hartree
energy: -2950.744263760118
dipole: -0.00534 0.00607 0.00073 8.00281 -6.87652 1.12628 -0.00264 0.00274 0.00010
magnitude: 1.12628 au
magnitude: 2.86278 debye
