program: Gaussian 09
title: 000066702
version: EM64L-G09RevD.01
frameworkgroup: C1[X(C10H8O5S)]
method: RPBEPBE
basis: SDD
operation: Freq
keyword: #p
keyword: freq=noraman
keyword: PBEPBE/SDD
title: #p freq=noraman PBEPBE/SDD
converged: YES YES NO NO
title: Mulliken charges:
elementType: S O O O O O C C C C C C C C C C H H H H H H H H
charge: 0.985596 -0.568542 -0.480169 -0.415659 -0.507908 -0.505170 0.445600 0.443583 -0.083748 -0.406388 -0.399251 -0.250774 -0.550310 -0.536659 0.170285 0.156320 0.289872 0.257099 0.282600 0.245755 0.270760 0.380890 0.383732 0.392485
chargesum: 0.00000
title: Mulliken charges with hydrogens summed into heavy atoms:
elementType: S O O O O O C C C C C C C C C C
charge: 0.985596 -0.187652 -0.096437 -0.023174 -0.507908 -0.505170 0.445600 0.443583 -0.083748 -0.116516 -0.142152 0.031826 -0.304555 -0.265898 0.170285 0.156320
polarizability: 2.68724323e+02 1.00638079e+01 1.51758352e+02 -1.01697587e+00 2.70537483e-01 7.68239922e+01
1716.lowfreq: -3.3343 0.0011 0.0020 0.0024 8.5521 9.1759 28.7510 58.0450 103.3165
frequency: 28.4701 57.9957 103.3122 124.8315 131.8133 165.6528 201.4589 223.2059 233.4789 290.9625 293.3677 299.2566 317.3905 332.7509 363.0586 382.7533 405.4275 421.7191 426.2286 478.9602 485.2723 509.0624 537.7047 584.9749 603.5968 630.1270 694.3160 698.4536 740.7270 764.0663 817.9261 829.4770 833.1856 835.3612 892.6304 902.6909 920.9760 965.0551 975.6323 1047.2874 1057.4941 1078.1946 1133.7647 1168.1970 1173.7783 1203.9640 1257.7313 1267.1208 1282.2967 1351.1194 1422.8246 1429.4570 1443.2396 1488.6617 1524.5252 1596.2061 1604.4169 1647.4323 3129.7738 3145.0664 3147.7646 3165.8452 3173.1274 3479.3789 3516.5736 3622.0629
redmass: 7.1618 7.6105 8.4588 4.7209 7.4507 1.7421 6.7395 6.0260 4.1299 5.5924 5.3999 4.3300 1.8290 2.1264 8.0511 6.2971 9.3911 3.3695 5.9561 2.9220 7.3776 1.1112 10.1969 5.1031 5.0812 6.9973 6.3688 5.2690 6.5895 2.4102 1.3690 4.8335 5.1440 1.5597 1.6507 5.7884 1.5552 15.1727 1.3882 1.2784 2.0416 2.4480 1.5366 1.4264 1.3131 1.4123 2.2226 2.1227 1.9461 1.9678 8.2063 2.7577 3.9147 4.7581 4.4210 6.9205 7.2378 7.1595 1.0922 1.0896 1.0921 1.0926 1.0967 1.0661 1.0649 1.0667
irintensity: 1.9684 0.9115 1.0659 3.9896 0.5799 49.5866 10.5596 10.4343 21.4731 27.9355 1.5453 33.3515 58.7730 118.8513 40.6213 3.6343 65.4113 2.4285 8.5591 31.9388 8.8559 111.4608 165.7277 28.6100 35.0898 39.3082 3.6844 4.9081 9.0450 0.4388 22.4592 10.0483 118.5842 27.3124 45.6046 0.5470 36.6138 82.4467 2.8961 52.1565 134.7700 148.3550 60.6816 17.2931 182.7868 43.8706 32.1335 139.3513 103.0065 15.9812 15.3277 26.4754 13.9246 96.3072 167.0963 0.9018 5.2830 32.8313 8.9991 5.0821 3.9231 2.7487 5.3507 42.0744 155.2428 83.4285
temp: 298.150 k
press: 1.00000 atm
elementType: 16 8 8 8 8 8 6 6 6 6 6 6 6 6 6 6 1 1 1 1 1 1 1 1
symmnumber: 1
zpe: 425037.0 jmol-1
zpe.correction: 0.161888 hartree
zpe.thermalcorrener: 0.176882 hartree
zpe.thermalcorrenthalpy: 0.177826 hartree
zpe.thermalcorrgfe: 0.119694 hartree
zpe.sumelectzpe: -1158.722689 hartree
zpe.sumelectthermal: -1158.707695 hartree
zpe.sumelectthermalent: -1158.706750 hartree
zpe.sumelectthermalfe: -1158.764883 hartree
dipole: -5.0491 -1.8584 1.3586
dipole: 5.5491
quadrupole: -103.3132 -88.2766 -106.2728
quadrupole: 14.2221 10.0234 -1.2214
quadrupole: -4.0257 11.0109 -6.9852 14.2221 10.0234 -1.2214
hfenergy: -1158.8845767 hartree
pointgroup: C01 [X(C10H8O5S1)]
dipole: 2.0243877 -0.6630898 -0.4780071 debye
dipolederiv: 2.368977 0.1343835 0.0893839 0.4142795 1.2430176 0.0283697 0.2557623 0.0615342 1.6336734 -0.6480177 0.0093279 -0.2508969 -0.0497681 -0.5465294 -0.0639803 -0.4074017 -0.083936 -0.9799177 -1.2178105 0.579342 -0.0381358 0.8898531 -0.6283977 0.0091935 -0.0532349 0.006914 -0.4313274 -1.7976481 -0.1711341 0.0150272 -0.3895487 -0.1782323 -0.0143965 0.0384521 -0.0147294 -0.405165 -0.7279711 -0.0609871 -0.013834 -0.1887643 -0.6337852 0.118494 0.0039938 0.0396569 -0.5107368 -0.8430317 0.0308345 0.0643291 0.0246938 -0.5502051 -0.106562 0.0049151 -0.0319998 -0.517552 -0.1460501 -0.1909981 0.0122143 -0.2648643 -0.0382582 0.0051227 0.003325 0.0023692 0.0382693 0.4567347 0.0655677 -0.0059775 0.233661 -0.0944346 0.0091696 -0.020656 0.0103621 0.033848 -0.4257815 0.0640748 0.0097286 0.1245049 -0.0235872 -0.0056392 0.1970054 0.0160665 -0.1622106 0.2484011 0.1026587 -0.0128903 -0.3053307 -0.0779074 -0.002868 -0.0025118 -0.0165023 -0.0970265 -0.0856433 0.0382318 -0.0063077 -0.0939743 0.1390103 -0.0192745 -0.009175 -0.024632 -0.1437598 -0.2545641 -0.1336726 0.0028353 0.2105015 0.0074878 -0.010731 -0.0411436 0.0079668 -0.1075802 -0.2250818 0.1672555 -0.0109722 -0.0656316 -0.0094155 -0.0125881 0.0122863 -0.0110966 -0.1785592 -0.5332835 -0.0677264 0.0027896 0.2482499 0.0834717 -0.0179396 -0.0143153 -0.0176407 -0.1838609 0.8022238 -0.5569238 0.0331663 -1.1121104 0.5260704 -0.0281015 0.0682209 -0.0276509 0.0456349 1.6664051 0.1921993 -0.018415 0.5814851 0.0320381 0.0014715 -0.0527423 0.0027606 0.0883528 0.1421604 -0.0028173 0.0080778 -0.0052715 0.0332065 0.0082171 0.004323 0.0165671 0.1521633 0.032173 -0.0710312 0.0050674 -0.0191296 -0.06131 0.012867 0.0109081 0.0153872 0.1578607 0.0770697 0.0700868 0.0018876 0.032723 0.1015951 0.008172 0.007387 -0.0044964 0.1608494 0.0695874 -0.0261226 0.003244 0.0331282 -0.0745056 0.016915 -0.0022726 0.0175304 0.1739209 0.0761522 0.005312 0.0005294 -0.0514034 -0.0236204 0.0129951 0.0041953 0.0126448 0.1708001 0.1044234 -0.0591436 0.0989297 -0.05637 0.3336103 0.0255721 -0.019078 -0.0040844 0.2591129 0.3263626 -0.1820053 0.0141309 -0.1978895 0.2287994 0.0132704 0.0138409 0.0145195 0.4095664 0.5342133 0.0632875 -0.0039115 0.0069763 0.2118815 0.012251 -0.0020839 0.0124893 0.3936441 unknown
polarizability: 269.4207703|-4.352495|150.7851813|1.1313037|-4.5480456|77.1007157 unknown
InChI: InChI=1S/C10H8O5S/c11-9-4-6-1-2-8(16(13,14)15)3-7(6)5-10(9)12/h1-5,11-13H
charge 0 multiplicity 1
24 atoms
S  -3.480277 -0.48878 0.117581
O  -3.757246 -0.564386 -1.722296
O  4.218906 -1.60284 0.097324
O  4.643708 1.022314 -0.080784
O  -3.522875 -1.996767 0.705453
O  -4.454032 0.655305 0.720644
C  0.647071 -0.378437 0.045156
C  0.917529 1.046221 -0.053275
C  -1.720075 0.120262 0.033792
C  -0.70815 -0.829992 0.084484
C  -0.182555 1.966518 -0.099542
C  -1.504489 1.519973 -0.059787
C  1.744092 -1.30199 0.098225
C  2.27389 1.500694 -0.093733
C  3.047304 -0.823936 0.055254
C  3.32363 0.588412 -0.041232
H  -0.947152 -1.895753 0.168126
H  0.026001 3.039467 -0.168715
H  -2.351928 2.210812 -0.081107
H  1.539105 -2.376924 0.172632
H  2.502959 2.567934 -0.165959
H  -4.720597 -0.79701 -1.867813
H  4.033083 -2.569673 0.165365
H  5.249497 0.235376 -0.030596
