program: Orca
programVersion: 5.0.2
elementType: S S S P P O O O O O O C C C C C C C C C C C C C C C C H H H H H H H H H H H H H H H H H H H H
charge: 0
multiplicity: 1
keywords: wb97x-d3
keywords: def2-TZVPP
keywords: def2/J RIJCOSX
keywords: DEFGRID2
keywords: scfconv7
keywords: smallprint printgap noloewdin
keywords: NOSOSCF
formula: C16H20O6P2S3
InChI: InChI=1/C16H20O6P2S3/c1-17-23(25,18-2)21-13-5-9-15(10-6-13)27-16-11-7-14(8-12-16)22-24(26,19-3)20-4/h5-12H,1-4H3
47 atoms
S  0.102828 -2.475098 1.277582
S  -5.436021 2.106806 1.54635
S  6.861936 -0.68811 0.182544
P  -5.988073 0.743513 0.317622
P  5.959213 0.549171 -0.969551
O  -4.848754 0.132132 -0.651805
O  4.500325 1.058097 -0.492381
O  -7.085386 1.146025 -0.762035
O  -6.590928 -0.593006 0.934063
O  6.666235 1.950105 -1.231437
O  5.635313 0.061534 -2.448408
C  -1.348002 -1.643554 0.696046
C  1.408297 -1.415289 0.724665
C  -3.6956 -0.45006 -0.154518
C  3.501803 0.190464 -0.093475
C  -2.450572 -2.425049 0.362657
C  1.544496 -1.078463 -0.619982
C  -1.435529 -0.257239 0.608665
C  2.337538 -0.955962 1.650142
C  -3.633366 -1.828765 -0.047022
C  2.584658 -0.263355 -1.030797
C  -2.605467 0.341355 0.170126
C  3.398921 -0.161145 1.240401
C  -7.099158 2.440987 -1.375786
C  -7.493198 -0.559019 2.047082
C  7.253881 2.697425 -0.159014
C  6.590946 -0.685455 -3.212269
H  -2.393793 -3.505025 0.41279
H  0.832677 -1.440296 -1.350395
H  -0.592453 0.367459 0.871878
H  2.236251 -1.208746 2.697243
H  -4.485994 -2.439535 -0.313186
H  2.677844 0.018959 -2.071147
H  -2.663926 1.417632 0.081471
H  4.117896 0.20444 1.96104
H  -6.228136 2.5793 -2.015834
H  -7.129494 3.230184 -0.625178
H  -8.000309 2.486587 -1.981023
H  -7.709157 -1.593115 2.301033
H  -7.037479 -0.064459 2.904244
H  -8.42139 -0.05222 1.784033
H  6.494924 3.026774 0.550456
H  8.008219 2.108159 0.361964
H  7.724706 3.567214 -0.608573
H  7.474416 -0.085264 -3.428096
H  6.885871 -1.594395 -2.688944
H  6.100814 -0.949928 -4.145135
elementType: S P O C H
totalener: -2950.72122952 hartree
nucrepener: 3238.78778805 hartree
electener: -6189.50901758 hartree
twoeener: 4319.99654667 hartree
cpcmener: -0.03395900 hartree
kineticenergy: 2942.56348291 hartree
xcener: -192.749692927815 hartree
chargesum: -0.0000000
charge: -0.041041 -0.455239 -0.453786 0.774279 0.774647 -0.357602 -0.355992 -0.343618 -0.342397 -0.342020 -0.343767 0.037794 0.039638 0.261937 0.258330 -0.146341 -0.157421 -0.150236 -0.128063 -0.191484 -0.168236 -0.197725 -0.193385 -0.111395 -0.114177 -0.111216 -0.115175 0.137665 0.156243 0.156608 0.138716 0.153932 0.156192 0.147824 0.150359 0.128460 0.110523 0.130726 0.129149 0.111810 0.127764 0.128243 0.109132 0.130544 0.128222 0.112331 0.129245
qa: -0.0410 -0.4552 -0.4538 0.7743 0.7746 -0.3576 -0.3560 -0.3436 -0.3424 -0.3420 -0.3438 0.0378 0.0396 0.2619 0.2583 -0.1463 -0.1574 -0.1502 -0.1281 -0.1915 -0.1682 -0.1977 -0.1934 -0.1114 -0.1142 -0.1112 -0.1152 0.1377 0.1562 0.1566 0.1387 0.1539 0.1562 0.1478 0.1504 0.1285 0.1105 0.1307 0.1291 0.1118 0.1278 0.1282 0.1091 0.1305 0.1282 0.1123 0.1292
va: 2.3597 1.9869 1.9878 5.4890 5.4915 2.1025 2.1010 2.0944 2.1096 2.0981 2.1120 3.7784 3.7309 3.6935 3.7058 3.9573 3.9503 3.9149 3.9845 4.0659 4.0320 4.0284 4.0364 3.8318 3.8428 3.8354 3.8418 1.0104 0.9910 0.9889 1.0128 1.0032 1.0039 1.0110 1.0055 0.9854 1.0016 0.9906 0.9905 0.9998 0.9860 0.9860 1.0009 0.9904 0.9861 0.9998 0.9903
dispcorr: -0.022764717 hartree
energy: -2950.743994239830
dipole: -2.19413 1.69705 -0.49708 4.64156 -3.90854 0.73302 -4.76955 3.53482 -1.23473
magnitude: 1.51953 au
magnitude: 3.86233 debye
