program: Orca
programVersion: 5.0.2
elementType: S S S P P O O O O O O C C C C C C C C C C C C C C C C H H H H H H H H H H H H H H H H H H H H
charge: 0
multiplicity: 1
keywords: wb97x-d3
keywords: def2-TZVPP
keywords: def2/J RIJCOSX
keywords: DEFGRID2
keywords: scfconv7
keywords: smallprint printgap noloewdin
keywords: NOSOSCF
formula: C16H20O6P2S3
InChI: InChI=1/C16H20O6P2S3/c1-17-23(25,18-2)21-13-5-9-15(10-6-13)27-16-11-7-14(8-12-16)22-24(26,19-3)20-4/h5-12H,1-4H3
47 atoms
S  -0.150119 -3.271595 0.007632
S  -3.971344 2.541087 -0.240153
S  6.167604 -0.896859 -1.558272
P  -5.274699 1.455039 0.642288
P  5.464034 0.695195 -0.754992
O  -5.151317 -0.14219 0.361016
O  4.408378 0.483322 0.450653
O  -6.811229 1.668573 0.288588
O  -5.265033 1.629056 2.220041
O  6.507111 1.680735 -0.068456
O  4.637452 1.68566 -1.687263
C  -1.601942 -2.264355 0.111017
C  1.164228 -2.093949 0.151894
C  -3.950643 -0.81137 0.293412
C  3.334941 -0.383158 0.321924
C  -1.883563 -1.530737 1.260536
C  1.064526 -0.789731 -0.322772
C  -2.508683 -2.26841 -0.941907
C  2.361001 -2.531272 0.713705
C  -3.05151 -0.793803 1.352259
C  2.147202 0.070524 -0.229796
C  -3.688143 -1.542968 -0.851586
C  3.453475 -1.68087 0.787898
C  -7.266075 1.691932 -1.070391
C  -6.122971 0.870197 3.089496
C  7.614161 1.185365 0.695175
C  5.150757 2.101261 -2.959606
H  -1.192356 -1.532439 2.093233
H  0.145542 -0.431807 -0.767931
H  -2.298223 -2.831081 -1.841802
H  2.449662 -3.538624 1.10035
H  -3.262636 -0.238305 2.256778
H  2.058444 1.08845 -0.585685
H  -4.395842 -1.544945 -1.670383
H  4.380847 -2.023092 1.227359
H  -7.132966 0.720355 -1.545655
H  -6.73942 2.454414 -1.644195
H  -8.324755 1.933388 -1.039588
H  -5.763762 1.040855 4.100403
H  -7.152873 1.215103 3.011478
H  -6.075252 -0.196373 2.872636
H  7.271884 0.643692 1.576647
H  8.246072 0.535832 0.090427
H  8.186316 2.054156 1.008843
H  6.064379 2.683199 -2.840656
H  5.344794 1.243053 -3.602571
H  4.3860 2.725419 -3.413451
elementType: S P O C H
totalener: -2950.72264388 hartree
nucrepener: 3284.54068167 hartree
electener: -6235.26332555 hartree
twoeener: 4365.74829377 hartree
cpcmener: -0.03837603 hartree
kineticenergy: 2942.53517565 hartree
xcener: -192.743708550294 hartree
chargesum: -0.0000000
charge: -0.049016 -0.432251 -0.456658 0.731636 0.774875 -0.339969 -0.358077 -0.339117 -0.348411 -0.343802 -0.341844 0.035293 0.048816 0.244111 0.235186 -0.145644 -0.160682 -0.121269 -0.148156 -0.156191 -0.174986 -0.198165 -0.187495 -0.108593 -0.119792 -0.112686 -0.115185 0.153930 0.152286 0.139016 0.136757 0.157753 0.156464 0.153626 0.149781 0.126993 0.107557 0.130917 0.130904 0.130312 0.123876 0.129235 0.110540 0.131131 0.127387 0.110517 0.129088
qa: -0.0490 -0.4323 -0.4567 0.7316 0.7749 -0.3400 -0.3581 -0.3391 -0.3484 -0.3438 -0.3418 0.0353 0.0488 0.2441 0.2352 -0.1456 -0.1607 -0.1213 -0.1482 -0.1562 -0.1750 -0.1982 -0.1875 -0.1086 -0.1198 -0.1127 -0.1152 0.1539 0.1523 0.1390 0.1368 0.1578 0.1565 0.1536 0.1498 0.1270 0.1076 0.1309 0.1309 0.1303 0.1239 0.1292 0.1105 0.1311 0.1274 0.1105 0.1291
va: 2.3500 2.0171 1.9843 5.5037 5.4906 2.0611 2.0993 2.0896 2.0904 2.0960 2.1125 3.7197 3.7814 3.7143 3.7156 3.9756 3.9196 3.9756 3.9532 3.9483 4.0383 4.0455 4.0346 3.8385 3.8264 3.8338 3.8442 0.9950 0.9923 1.0120 1.0106 0.9999 1.0057 0.9981 1.0034 0.9875 1.0003 0.9892 0.9889 0.9950 0.9908 0.9849 1.0013 0.9909 0.9870 0.9995 0.9896
dispcorr: -0.023674979 hartree
energy: -2950.746318863609
dipole: -3.65456 2.12101 -1.53355 3.74404 -3.65705 0.08699 0.77977 -0.16211 0.61766
magnitude: 1.65555 au
magnitude: 4.20807 debye
