program: Orca
programVersion: 5.0.2
elementType: S S S P P O O O O O O C C C C C C C C C C C C C C C C H H H H H H H H H H H H H H H H H H H H
charge: 0
multiplicity: 1
keywords: wb97x-d3
keywords: def2-TZVPP
keywords: def2/J RIJCOSX
keywords: DEFGRID2
keywords: scfconv7
keywords: smallprint printgap noloewdin
keywords: NOSOSCF
formula: C16H20O6P2S3
InChI: InChI=1/C16H20O6P2S3/c1-17-23(25,18-2)21-13-5-9-15(10-6-13)27-16-11-7-14(8-12-16)22-24(26,19-3)20-4/h5-12H,1-4H3
47 atoms
S  0.078826 -3.266304 -0.10128
S  -5.356334 1.018839 -1.429679
S  4.181534 2.623931 -0.379558
P  -5.569022 0.882507 0.46875
P  5.402238 1.154609 -0.484558
O  -4.249198 0.505955 1.324161
O  4.942408 -0.140417 -1.339664
O  -6.584126 -0.209182 1.026127
O  -6.041383 2.190935 1.241404
O  6.756067 1.536745 -1.220916
O  5.784153 0.447852 0.895621
C  -1.180178 -2.080844 0.271534
C  1.497117 -2.266679 -0.442578
C  -3.263815 -0.373645 0.932555
C  3.790618 -0.838311 -1.022409
C  -2.488516 -2.401203 -0.072487
C  1.445357 -1.195525 -1.330909
C  -0.924156 -0.898164 0.959292
C  2.708027 -2.623881 0.139057
C  -3.536933 -1.559767 0.270554
C  2.589117 -0.466272 -1.607517
C  -1.961448 -0.035991 1.269607
C  3.863344 -1.914707 -0.156601
C  -7.857161 -0.416053 0.401314
C  -5.605098 3.492933 0.830322
C  7.792283 0.57632 -1.487384
C  6.031513 1.215669 2.079251
H  -2.707524 -3.314549 -0.610736
H  0.512526 -0.91835 -1.804334
H  0.084168 -0.634829 1.250028
H  2.756954 -3.452708 0.833139
H  -4.546393 -1.850434 0.013399
H  2.550982 0.368136 -2.29481
H  -1.759321 0.890188 1.791764
H  4.806174 -2.203443 0.287959
H  -8.464285 0.488505 0.429167
H  -8.355455 -1.197492 0.968031
H  -7.736147 -0.741692 -0.631503
H  -4.519113 3.577524 0.865519
H  -5.955586 3.719802 -0.175608
H  -6.041176 4.198587 1.531657
H  8.023293 -0.025083 -0.608688
H  7.509802 -0.074475 -2.313287
H  8.674819 1.145228 -1.766646
H  6.850059 1.920002 1.932141
H  5.136647 1.75656 2.384862
H  6.307226 0.506788 2.85498
elementType: S P O C H
totalener: -2950.72078111 hartree
nucrepener: 3278.71663281 hartree
electener: -6229.43741392 hartree
twoeener: 4359.87181717 hartree
cpcmener: -0.03756127 hartree
kineticenergy: 2942.55254779 hartree
xcener: -192.749211321196 hartree
chargesum: -0.0000000
charge: -0.032742 -0.449115 -0.438229 0.764859 0.737007 -0.329374 -0.357484 -0.345149 -0.347471 -0.341814 -0.333799 0.039735 0.034826 0.235301 0.271311 -0.161326 -0.149427 -0.151462 -0.133930 -0.163820 -0.198155 -0.188170 -0.187557 -0.115368 -0.115648 -0.111539 -0.112420 0.137542 0.158997 0.156133 0.138606 0.141344 0.150662 0.152730 0.154099 0.130033 0.131225 0.112800 0.126632 0.113502 0.131061 0.122624 0.120978 0.128682 0.128940 0.115405 0.128965
qa: -0.0327 -0.4491 -0.4382 0.7649 0.7370 -0.3294 -0.3575 -0.3451 -0.3475 -0.3418 -0.3338 0.0397 0.0348 0.2353 0.2713 -0.1613 -0.1494 -0.1515 -0.1339 -0.1638 -0.1982 -0.1882 -0.1876 -0.1154 -0.1156 -0.1115 -0.1124 0.1375 0.1590 0.1561 0.1386 0.1413 0.1507 0.1527 0.1541 0.1300 0.1312 0.1128 0.1266 0.1135 0.1311 0.1226 0.1210 0.1287 0.1289 0.1154 0.1290
va: 2.3839 1.9815 2.0231 5.4765 5.5140 2.1332 2.0820 2.0827 2.0979 2.1014 2.0593 3.7768 3.7506 3.7489 3.6886 3.9937 3.9336 3.9253 3.9728 3.9607 4.0254 3.9929 4.0528 3.8350 3.8392 3.8416 3.8331 1.0130 0.9884 0.9882 1.0127 1.0142 1.0068 1.0019 1.0037 0.9889 0.9909 0.9991 0.9858 0.9989 0.9916 0.9918 0.9909 0.9896 0.9855 1.0011 0.9914
dispcorr: -0.023306170 hartree
energy: -2950.744087279471
dipole: 2.85436 -1.84234 1.01202 1.87572 -2.39621 -0.52049 5.22198 -3.95260 1.26939
magnitude: 1.70483 au
magnitude: 4.33333 debye
