program: Orca
programVersion: 5.0.2
elementType: S S S P P O O O O O O C C C C C C C C C C C C C C C C H H H H H H H H H H H H H H H H H H H H
charge: 0
multiplicity: 1
keywords: wb97x-d3
keywords: def2-TZVPP
keywords: def2/J RIJCOSX
keywords: DEFGRID2
keywords: scfconv7
keywords: smallprint printgap noloewdin
keywords: NOSOSCF
formula: C16H20O6P2S3
InChI: InChI=1/C16H20O6P2S3/c1-17-23(25,18-2)21-13-5-9-15(10-6-13)27-16-11-7-14(8-12-16)22-24(26,19-3)20-4/h5-12H,1-4H3
47 atoms
S  -0.0430 -3.176314 -0.343644
S  -4.616358 0.985756 2.798664
S  4.626104 1.333574 -2.532726
P  -5.573207 0.848976 1.145616
P  5.60194 0.888447 -0.946483
O  -4.702695 0.46468 -0.163181
O  4.752295 0.235595 0.266256
O  -6.3154 2.160053 0.633693
O  -6.729441 -0.239823 1.035409
O  6.764162 -0.190912 -1.075589
O  6.34114 2.077056 -0.187649
C  -1.406203 -2.051177 -0.271647
C  1.361094 -2.11521 -0.168495
C  -3.625315 -0.39389 -0.16217
C  3.641621 -0.56183 0.087632
C  -1.39592 -0.823363 -0.929203
C  1.391689 -1.062219 0.742105
C  -2.545277 -2.446787 0.419924
C  2.48956 -2.393648 -0.930626
C  -2.494368 0.014762 -0.853789
C  2.521724 -0.270856 0.852342
C  -3.665536 -1.629148 0.463081
C  3.639644 -1.630419 -0.793275
C  -5.713818 3.45337 0.775815
C  -7.711305 -0.370823 2.073434
C  7.724457 -0.1064 -2.136471
C  5.735442 3.372711 -0.079945
H  -0.526555 -0.503573 -1.488476
H  0.530238 -0.839276 1.35772
H  -2.570225 -3.397632 0.936393
H  2.482103 -3.206413 -1.645322
H  -2.47931 0.978178 -1.346659
H  2.536556 0.561767 1.543653
H  -4.548351 -1.969919 0.987313
H  4.512858 -1.879169 -1.3814
H  -5.573389 3.702561 1.826707
H  -6.401503 4.163299 0.325453
H  -4.756389 3.503698 0.257721
H  -8.306763 0.536899 2.167337
H  -8.357961 -1.194898 1.785588
H  -7.240453 -0.598711 3.029329
H  8.390222 -0.956462 -2.018536
H  7.236312 -0.162644 -3.109127
H  8.303323 0.81455 -2.071145
H  5.563405 3.804682 -1.064967
H  4.793476 3.324172 0.466017
H  6.435353 3.995344 0.469623
elementType: S P O C H
totalener: -2950.72095122 hartree
nucrepener: 3266.74412356 hartree
electener: -6217.46507478 hartree
twoeener: 4347.88797261 hartree
cpcmener: -0.03568295 hartree
kineticenergy: 2942.55902769 hartree
xcener: -192.751690544765 hartree
chargesum: -0.0000000
charge: -0.032330 -0.449625 -0.449747 0.767017 0.768666 -0.334179 -0.337629 -0.346660 -0.344687 -0.344226 -0.347472 0.046260 0.046925 0.225904 0.225626 -0.160579 -0.161298 -0.153029 -0.153839 -0.174768 -0.174102 -0.167324 -0.163094 -0.116716 -0.115591 -0.116542 -0.116486 0.156193 0.156256 0.137071 0.137372 0.153215 0.153189 0.148633 0.147753 0.112856 0.131596 0.127684 0.129761 0.131448 0.111829 0.131416 0.111215 0.129812 0.113481 0.127548 0.131197
qa: -0.0323 -0.4496 -0.4497 0.7670 0.7687 -0.3342 -0.3376 -0.3467 -0.3447 -0.3442 -0.3475 0.0463 0.0469 0.2259 0.2256 -0.1606 -0.1613 -0.1530 -0.1538 -0.1748 -0.1741 -0.1673 -0.1631 -0.1167 -0.1156 -0.1165 -0.1165 0.1562 0.1563 0.1371 0.1374 0.1532 0.1532 0.1486 0.1478 0.1129 0.1316 0.1277 0.1298 0.1314 0.1118 0.1314 0.1112 0.1298 0.1135 0.1275 0.1312
va: 2.3848 1.9832 1.9821 5.4747 5.4724 2.1234 2.1196 2.0984 2.0907 2.0907 2.0978 3.7457 3.7457 3.7493 3.7458 3.9313 3.9311 4.0024 3.9972 3.9871 3.9890 3.9690 3.9640 3.8398 3.8346 3.8365 3.8397 0.9888 0.9887 1.0137 1.0137 1.0003 0.9998 1.0111 1.0108 0.9996 0.9914 0.9850 0.9892 0.9902 1.0000 0.9906 0.9998 0.9887 0.9995 0.9849 0.9915
dispcorr: -0.023005822 hartree
energy: -2950.743957042874
dipole: -0.03712 0.01600 -0.02112 8.52179 -7.22754 1.29425 0.72608 -0.61750 0.10858
magnitude: 1.29897 au
magnitude: 3.30172 debye
