program: Orca
programVersion: 5.0.2
elementType: S S S P P O O O O O O C C C C C C C C C C C C C C C C H H H H H H H H H H H H H H H H H H H H
charge: 0
multiplicity: 1
keywords: wb97x-d3
keywords: def2-TZVPP
keywords: def2/J RIJCOSX
keywords: DEFGRID2
keywords: scfconv7
keywords: smallprint printgap noloewdin
keywords: NOSOSCF
formula: C16H20O6P2S3
InChI: InChI=1/C16H20O6P2S3/c1-17-23(25,18-2)21-13-5-9-15(10-6-13)27-16-11-7-14(8-12-16)22-24(26,19-3)20-4/h5-12H,1-4H3
47 atoms
S  0.146835 -3.226975 0.079454
S  -4.752183 1.099129 2.735651
S  3.88216 1.980797 -2.107813
P  -5.540373 0.82257 1.011673
P  5.391876 1.094145 -1.340167
O  -4.539553 0.370652 -0.172372
O  5.041186 0.074565 -0.122756
O  -6.256465 2.067453 0.324411
O  -6.659468 -0.302423 0.87675
O  6.215833 0.249694 -2.400135
O  6.52694 1.964392 -0.643125
C  -1.203161 -2.083975 0.050852
C  1.568705 -2.179684 -0.008825
C  -3.445325 -0.453991 -0.038708
C  3.883706 -0.674218 -0.114313
C  -2.350872 -2.425522 0.758139
C  2.567224 -2.498101 -0.921388
C  -1.187939 -0.914191 -0.704195
C  1.739801 -1.101842 0.856926
C  -3.48079 -1.622948 0.70382
C  3.736631 -1.752639 -0.968905
C  -2.299517 -0.089875 -0.730796
C  2.888847 -0.334084 0.790026
C  -5.69413 3.383614 0.408349
C  -7.735097 -0.375679 1.82209
C  7.413581 -0.471344 -2.06586
C  6.192426 2.960989 0.331763
H  -2.377831 -3.326253 1.357853
H  2.438174 -3.326808 -1.6051
H  -0.310042 -0.631108 -1.269903
H  0.973664 -0.849647 1.578303
H  -4.370856 -1.927959 1.237707
H  4.517125 -2.013195 -1.672397
H  -2.283637 0.824857 -1.309087
H  3.021614 0.512654 1.45065
H  -4.72416 3.429017 -0.086554
H  -5.588737 3.698276 1.446096
H  -6.386877 4.048459 -0.099916
H  -8.372262 0.506074 1.758908
H  -8.315854 -1.256463 1.563304
H  -7.356113 -0.479874 2.838649
H  7.575388 -1.187063 -2.866965
H  8.262921 0.207659 -2.013102
H  7.315783 -1.010835 -1.124575
H  5.425724 3.637196 -0.046821
H  5.846355 2.49984 1.25638
H  7.100579 3.524173 0.527358
elementType: S P O C H
totalener: -2950.72196650 hartree
nucrepener: 3276.27054919 hartree
electener: -6226.99251569 hartree
twoeener: 4357.38604792 hartree
cpcmener: -0.03840306 hartree
kineticenergy: 2942.55725360 hartree
xcener: -192.749683484301 hartree
chargesum: 0.0000000
charge: -0.036004 -0.449998 -0.435533 0.765197 0.736414 -0.329613 -0.353386 -0.346934 -0.345063 -0.349972 -0.337737 0.040907 0.053310 0.227322 0.236243 -0.159474 -0.149722 -0.148483 -0.154567 -0.160981 -0.158778 -0.186258 -0.181150 -0.116467 -0.113919 -0.122136 -0.107404 0.136392 0.137994 0.152516 0.156319 0.143990 0.160215 0.152624 0.153990 0.127947 0.111473 0.131320 0.129518 0.130954 0.110502 0.130451 0.129861 0.124497 0.105580 0.127116 0.130929
qa: -0.0360 -0.4500 -0.4355 0.7652 0.7364 -0.3296 -0.3534 -0.3469 -0.3451 -0.3500 -0.3377 0.0409 0.0533 0.2273 0.2362 -0.1595 -0.1497 -0.1485 -0.1546 -0.1610 -0.1588 -0.1863 -0.1811 -0.1165 -0.1139 -0.1221 -0.1074 0.1364 0.1380 0.1525 0.1563 0.1440 0.1602 0.1526 0.1540 0.1279 0.1115 0.1313 0.1295 0.1310 0.1105 0.1305 0.1299 0.1245 0.1056 0.1271 0.1309
va: 2.3778 1.9835 2.0127 5.4787 5.5038 2.1292 2.0512 2.0998 2.0880 2.0966 2.0886 3.7706 3.7169 3.7478 3.7061 3.9939 4.0038 3.9195 3.9399 3.9664 4.0116 3.9944 4.0184 3.8401 3.8339 3.8306 3.8361 1.0134 1.0144 0.9918 0.9894 1.0139 0.9935 1.0009 0.9968 0.9850 1.0003 0.9909 0.9895 0.9899 1.0007 0.9890 0.9940 0.9916 1.0019 0.9886 0.9893
dispcorr: -0.023613292 hartree
energy: -2950.745579791261
dipole: 1.99985 -1.18507 0.81478 4.64143 -4.40677 0.23466 3.59018 -2.78826 0.80192
magnitude: 1.16705 au
magnitude: 2.96640 debye
