program: Orca
programVersion: 5.0.2
elementType: S S S P P O O O O O O C C C C C C C C C C C C C C C C H H H H H H H H H H H H H H H H H H H H
charge: 0
multiplicity: 1
keywords: wb97x-d3
keywords: def2-TZVPP
keywords: def2/J RIJCOSX
keywords: DEFGRID2
keywords: scfconv7
keywords: smallprint printgap noloewdin
keywords: NOSOSCF
formula: C16H20O6P2S3
InChI: InChI=1/C16H20O6P2S3/c1-17-23(25,18-2)21-13-5-9-15(10-6-13)27-16-11-7-14(8-12-16)22-24(26,19-3)20-4/h5-12H,1-4H3
47 atoms
S  0.015442 -3.027199 0.007902
S  -5.220515 1.218339 -1.745006
S  5.193984 1.282161 1.716646
P  -5.837475 0.828169 0.025659
P  5.845012 0.858982 -0.03362
O  -4.72034 0.346831 1.09169
O  4.750213 0.336998 -1.105004
O  -6.910279 -0.333554 0.201472
O  -6.521429 2.02083 0.828848
O  6.524877 2.040119 -0.856709
O  6.939329 -0.289883 -0.165501
C  -1.354979 -1.943929 0.278964
C  1.38632 -1.946898 -0.271584
C  -3.621318 -0.425337 0.778046
C  3.651484 -0.432039 -0.783858
C  -2.596199 -2.354636 -0.195399
C  1.294762 -0.789729 -1.040741
C  -1.259303 -0.764937 1.013581
C  2.622718 -2.337864 0.230929
C  -3.735045 -1.607564 0.065245
C  2.421725 -0.020593 -1.276072
C  -2.387404 0.004768 1.242997
C  3.761683 -1.593094 -0.036612
C  -8.038347 -0.424343 -0.678955
C  -5.995349 3.352498 0.752495
C  5.969859 3.361919 -0.837664
C  8.010914 -0.395786 0.781101
H  -2.68761 -3.264531 -0.774448
H  0.345711 -0.4740 -1.453617
H  -0.30694 -0.433053 1.405605
H  2.710325 -3.23057 0.836663
H  -4.693162 -1.962392 -0.290387
H  2.347547 0.886737 -1.861337
H  -2.30986 0.92834 1.801856
H  4.716883 -1.932317 0.341559
H  -8.629636 -1.268981 -0.336479
H  -7.716822 -0.600707 -1.704974
H  -8.647294 0.478499 -0.637139
H  -4.961275 3.39053 1.094879
H  -6.056342 3.736218 -0.265427
H  -6.610103 3.965114 1.406185
H  6.593594 3.967456 -1.489301
H  4.947112 3.367975 -1.214652
H  5.989473 3.776856 0.169522
H  7.626066 -0.534995 1.791001
H  8.590897 -1.268541 0.494434
H  8.651617 0.485402 0.752702
elementType: S P O C H
totalener: -2950.72126002 hartree
nucrepener: 3250.12751378 hartree
electener: -6200.84877380 hartree
twoeener: 4331.20960577 hartree
cpcmener: -0.03603809 hartree
kineticenergy: 2942.54303360 hartree
xcener: -192.748792457455 hartree
chargesum: 0.0000000
charge: -0.023280 -0.450446 -0.449394 0.767966 0.768606 -0.336619 -0.337520 -0.345297 -0.347325 -0.347018 -0.347281 0.054719 0.056642 0.213200 0.212154 -0.160554 -0.172844 -0.170221 -0.161452 -0.155581 -0.168566 -0.171036 -0.153302 -0.117111 -0.115873 -0.115770 -0.116388 0.137348 0.158340 0.157793 0.137575 0.149679 0.153676 0.153685 0.149765 0.131862 0.113373 0.129694 0.127317 0.112702 0.130975 0.131000 0.127189 0.111977 0.113151 0.131517 0.130976
qa: -0.0233 -0.4504 -0.4494 0.7680 0.7686 -0.3366 -0.3375 -0.3453 -0.3473 -0.3470 -0.3473 0.0547 0.0566 0.2132 0.2122 -0.1606 -0.1728 -0.1702 -0.1615 -0.1556 -0.1686 -0.1710 -0.1533 -0.1171 -0.1159 -0.1158 -0.1164 0.1373 0.1583 0.1578 0.1376 0.1497 0.1537 0.1537 0.1498 0.1319 0.1134 0.1297 0.1273 0.1127 0.1310 0.1310 0.1272 0.1120 0.1132 0.1315 0.1310
va: 2.4078 1.9813 1.9821 5.4730 5.4722 2.1192 2.1177 2.0899 2.0971 2.0989 2.0870 3.7650 3.7597 3.7584 3.7595 3.9961 3.9433 3.9398 3.9985 3.9670 3.9865 3.9895 3.9653 3.8356 3.8404 3.8419 3.8326 1.0136 0.9879 0.9882 1.0137 1.0092 0.9994 0.9996 1.0078 0.9908 0.9990 0.9888 0.9849 0.9995 0.9916 0.9913 0.9848 0.9996 0.9997 0.9907 0.9886
dispcorr: -0.022883615 hartree
energy: -2950.744143638229
dipole: -0.18485 0.16345 -0.02140 7.54415 -6.50102 1.04314 0.09376 -0.06241 0.03135
magnitude: 1.04383 au
magnitude: 2.65319 debye
