program: Orca
programVersion: 5.0.2
elementType: S S S P P O O O O O O C C C C C C C C C C C C C C C C H H H H H H H H H H H H H H H H H H H H
charge: 0
multiplicity: 1
keywords: wb97x-d3
keywords: def2-TZVPP
keywords: def2/J RIJCOSX
keywords: DEFGRID2
keywords: scfconv7
keywords: smallprint printgap noloewdin
keywords: NOSOSCF
formula: C16H20O6P2S3
InChI: InChI=1/C16H20O6P2S3/c1-17-23(25,18-2)21-13-5-9-15(10-6-13)27-16-11-7-14(8-12-16)22-24(26,19-3)20-4/h5-12H,1-4H3
47 atoms
S  -0.113285 -3.320673 -0.604582
S  -3.75875 2.27187 1.182862
S  4.573163 1.67683 -2.539909
P  -5.234589 1.061424 1.013611
P  5.378122 0.96121 -0.954262
O  -4.926986 -0.492192 1.344415
O  4.37562 0.446509 0.20087
O  -5.90993 0.929762 -0.421135
O  -6.50017 1.31005 1.946249
O  6.310701 -0.317217 -1.125839
O  6.302439 1.938045 -0.101713
C  -1.523843 -2.426055 -0.01922
C  1.197469 -2.153968 -0.37185
C  -3.787368 -1.118453 0.874865
C  3.329583 -0.423129 -0.045606
C  -1.565597 -1.908507 1.273781
C  2.457144 -2.648129 -0.048382
C  -2.627777 -2.294675 -0.851758
C  1.018021 -0.784119 -0.544671
C  -2.691237 -1.236563 1.717023
C  3.531284 -1.784232 0.101861
C  -3.770077 -1.645647 -0.403851
C  2.082254 0.084872 -0.370828
C  -6.139651 2.085438 -1.239665
C  -6.338851 1.623638 3.336887
C  7.257066 -0.397766 -2.201041
C  5.914812 3.296659 0.142822
H  -0.716438 -2.017246 1.935761
H  2.608803 -3.709469 0.100956
H  -2.602655 -2.69076 -1.858176
H  0.048318 -0.382346 -0.807232
H  -2.724677 -0.825214 2.717171
H  4.505915 -2.17154 0.367911
H  -4.631578 -1.554928 -1.051605
H  1.938495 1.151113 -0.484168
H  -6.851243 2.763249 -0.769306
H  -6.554489 1.722286 -2.175634
H  -5.207688 2.61363 -1.438107
H  -7.334256 1.809748 3.730329
H  -5.88936 0.790201 3.87667
H  -5.726384 2.515266 3.468156
H  6.762739 -0.287429 -3.165786
H  8.030201 0.363255 -2.098511
H  7.712169 -1.382218 -2.139872
H  6.737764 3.762757 0.677435
H  5.745122 3.830487 -0.791948
H  5.015505 3.343326 0.756815
elementType: S P O C H
totalener: -2950.72188896 hartree
nucrepener: 3290.40443337 hartree
electener: -6241.12632232 hartree
twoeener: 4371.83662723 hartree
cpcmener: -0.03435174 hartree
kineticenergy: 2942.56372909 hartree
xcener: -192.748349055803 hartree
chargesum: 0.0000000
charge: -0.044995 -0.453890 -0.455189 0.777028 0.774724 -0.356354 -0.356428 -0.344902 -0.343436 -0.344285 -0.343138 0.039489 0.037920 0.248816 0.249212 -0.135367 -0.149305 -0.140285 -0.140070 -0.191197 -0.178784 -0.172003 -0.198050 -0.116412 -0.113308 -0.115327 -0.112004 0.155135 0.136575 0.137661 0.153398 0.153918 0.154741 0.157503 0.149242 0.129641 0.129778 0.112339 0.131870 0.128318 0.109700 0.111937 0.128016 0.129018 0.130994 0.109695 0.128060
qa: -0.0450 -0.4539 -0.4552 0.7770 0.7747 -0.3564 -0.3564 -0.3449 -0.3434 -0.3443 -0.3431 0.0395 0.0379 0.2488 0.2492 -0.1354 -0.1493 -0.1403 -0.1401 -0.1912 -0.1788 -0.1720 -0.1981 -0.1164 -0.1133 -0.1153 -0.1120 0.1551 0.1366 0.1377 0.1534 0.1539 0.1547 0.1575 0.1492 0.1296 0.1298 0.1123 0.1319 0.1283 0.1097 0.1119 0.1280 0.1290 0.1310 0.1097 0.1281
va: 2.3527 1.9846 1.9863 5.4832 5.4911 2.0982 2.1008 2.1083 2.1007 2.1117 2.0948 3.7206 3.7684 3.7095 3.6996 3.9241 3.9693 3.9984 3.9010 4.0070 4.0658 4.0487 4.0275 3.8403 3.8368 3.8426 3.8352 0.9913 1.0115 1.0136 0.9913 1.0003 1.0039 1.0044 1.0073 0.9859 0.9904 0.9998 0.9903 0.9859 1.0009 0.9997 0.9862 0.9902 0.9905 1.0011 0.9859
dispcorr: -0.023156046 hartree
energy: -2950.745045003648
dipole: 0.57439 -0.84268 -0.26829 6.81874 -6.31534 0.50340 1.35672 -0.63351 0.72321
magnitude: 0.92110 au
magnitude: 2.34124 debye
