program: Orca
programVersion: 5.0.2
elementType: S S S P P O O O O O O C C C C C C C C C C C C C C C C H H H H H H H H H H H H H H H H H H H H
charge: 0
multiplicity: 1
keywords: wb97x-d3
keywords: def2-TZVPP
keywords: def2/J RIJCOSX
keywords: DEFGRID2
keywords: scfconv7
keywords: smallprint printgap noloewdin
keywords: NOSOSCF
formula: C16H20O6P2S3
InChI: InChI=1/C16H20O6P2S3/c1-17-23(25,18-2)21-13-5-9-15(10-6-13)27-16-11-7-14(8-12-16)22-24(26,19-3)20-4/h5-12H,1-4H3
47 atoms
S  0.009139 -3.175673 1.084052
S  -3.88257 2.272543 -0.23421
S  6.354771 -0.42984 0.552225
P  -5.359378 1.08941 0.066305
P  5.425382 0.927026 -0.430239
O  -5.092088 -0.479656 -0.223142
O  4.076502 0.465226 -1.193836
O  -6.673064 1.325288 -0.801248
O  -5.952664 1.015967 1.54158
O  4.886239 2.183048 0.383992
O  6.200884 1.626261 -1.632723
C  -1.497687 -2.333841 0.685399
C  1.216501 -2.06428 0.416619
C  -3.889437 -1.082403 0.096101
C  3.152376 -0.381821 -0.611534
C  -2.46139 -2.171729 1.673084
C  2.252909 -2.581679 -0.351498
C  -1.747141 -1.878535 -0.607213
C  1.167219 -0.698294 0.682448
C  -3.667577 -1.5498 1.379164
C  3.234182 -1.740804 -0.856861
C  -2.936147 -1.234718 -0.899406
C  2.129875 0.148533 0.160782
C  -6.584677 1.592195 -2.207129
C  -6.149488 2.206375 2.31718
C  5.648863 2.764192 1.449657
C  7.021901 0.854937 -2.519696
H  -2.274373 -2.516934 2.681503
H  2.29627 -3.640663 -0.569987
H  -1.009754 -2.012733 -1.387855
H  0.373288 -0.28645 1.291654
H  -4.418273 -1.428741 2.148998
H  4.03567 -2.140045 -1.464021
H  -3.129464 -0.870191 -1.899618
H  2.078855 1.212543 0.350692
H  -7.602416 1.733649 -2.559985
H  -6.133836 0.754506 -2.739406
H  -6.007933 2.496881 -2.397218
H  -6.519358 1.885623 3.286992
H  -5.211548 2.744879 2.449134
H  -6.884766 2.861636 1.851164
H  5.049079 3.577426 1.848407
H  5.837207 2.035225 2.236953
H  6.595908 3.161494 1.085666
H  7.82901 0.36461 -1.97632
H  6.434539 0.106393 -3.051808
H  7.443491 1.553623 -3.236842
elementType: S P O C H
totalener: -2950.72196461 hartree
nucrepener: 3292.17871855 hartree
electener: -6242.90068315 hartree
twoeener: 4373.56597014 hartree
cpcmener: -0.03527993 hartree
kineticenergy: 2942.56449740 hartree
xcener: -192.747606483437 hartree
chargesum: 0.0000000
charge: -0.053716 -0.453968 -0.453432 0.776914 0.776640 -0.358323 -0.358312 -0.343905 -0.344949 -0.346772 -0.343931 0.034760 0.032447 0.247069 0.247202 -0.146982 -0.138117 -0.125605 -0.138608 -0.169954 -0.187046 -0.197526 -0.177043 -0.113600 -0.116881 -0.116449 -0.113236 0.137570 0.138364 0.152779 0.152741 0.156348 0.153013 0.154356 0.155620 0.132052 0.127438 0.110276 0.129887 0.112014 0.128906 0.130235 0.113191 0.128630 0.111034 0.127562 0.131310
qa: -0.0537 -0.4540 -0.4534 0.7769 0.7766 -0.3583 -0.3583 -0.3439 -0.3449 -0.3468 -0.3439 0.0348 0.0324 0.2471 0.2472 -0.1470 -0.1381 -0.1256 -0.1386 -0.1700 -0.1870 -0.1975 -0.1770 -0.1136 -0.1169 -0.1164 -0.1132 0.1376 0.1384 0.1528 0.1527 0.1563 0.1530 0.1544 0.1556 0.1321 0.1274 0.1103 0.1299 0.1120 0.1289 0.1302 0.1132 0.1286 0.1110 0.1276 0.1313
va: 2.3233 1.9826 1.9837 5.4812 5.4809 2.0948 2.0964 2.0985 2.1083 2.1062 2.0948 3.7188 3.7303 3.6991 3.7069 3.9893 3.9710 3.9053 3.9251 4.0515 4.0314 4.0130 4.0423 3.8396 3.8418 3.8416 3.8377 1.0133 1.0126 0.9909 0.9916 1.0041 1.0005 0.9986 1.0048 0.9906 0.9854 1.0005 0.9905 0.9996 0.9861 0.9909 0.9991 0.9858 1.0001 0.9853 0.9910
dispcorr: -0.023310101 hartree
energy: -2950.745274706123
dipole: -1.39002 0.63611 -0.75390 8.92532 -7.73461 1.19071 -2.05110 1.42939 -0.62170
magnitude: 1.54035 au
magnitude: 3.91526 debye
