program: Orca
programVersion: 5.0.2
elementType: S S S P P O O O O O O C C C C C C C C C C C C C C C C H H H H H H H H H H H H H H H H H H H H
charge: 0
multiplicity: 1
keywords: wb97x-d3
keywords: def2-TZVPP
keywords: def2/J RIJCOSX
keywords: DEFGRID2
keywords: scfconv7
keywords: smallprint printgap noloewdin
keywords: NOSOSCF
formula: C16H20O6P2S3
InChI: InChI=1/C16H20O6P2S3/c1-17-23(25,18-2)21-13-5-9-15(10-6-13)27-16-11-7-14(8-12-16)22-24(26,19-3)20-4/h5-12H,1-4H3
47 atoms
S  -0.013382 -2.971086 -0.523727
S  -6.246599 -1.013657 1.265207
S  5.523244 0.457416 -2.652252
P  -5.752392 0.756791 0.728554
P  5.745844 0.965046 -0.822386
O  -4.16411 1.061718 0.669885
O  5.067632 -0.036342 0.265409
O  -6.251126 1.969181 1.631049
O  -6.191196 1.240947 -0.722424
O  7.223047 1.040242 -0.233295
O  5.174973 2.4115 -0.502422
C  -1.26241 -1.771108 -0.162273
C  1.469944 -2.035621 -0.277686
C  -3.228729 0.090661 0.379573
C  3.865575 -0.676829 0.053335
C  -1.356542 -1.20564 1.106979
C  2.618842 -2.721165 0.105655
C  -2.167995 -1.407364 -1.1504
C  1.533529 -0.662505 -0.493216
C  -2.33638 -0.267614 1.378575
C  3.82071 -2.045836 0.254919
C  -3.163023 -0.478208 -0.880468
C  2.723897 0.021337 -0.311763
C  -6.178105 1.898292 3.061228
C  -7.518968 0.995728 -1.206465
C  8.148158 -0.033326 -0.455065
C  5.176006 2.971753 0.822239
H  -0.663207 -1.492507 1.886597
H  2.586554 -3.787359 0.291444
H  -2.095939 -1.835772 -2.141128
H  0.655504 -0.108154 -0.79666
H  -2.410469 0.180237 2.360942
H  4.713209 -2.584336 0.546258
H  -3.857239 -0.188495 -1.658442
H  2.744205 1.093476 -0.458416
H  -6.839927 1.12259 3.444969
H  -6.501351 2.865862 3.434746
H  -5.15903 1.707993 3.398316
H  -7.556974 1.391593 -2.217348
H  -7.733826 -0.072187 -1.229114
H  -8.261918 1.50491 -0.593463
H  8.328671 -0.174471 -1.520397
H  9.076229 0.250622 0.032782
H  7.7851 -0.964607 -0.020439
H  6.186548 3.237318 1.128692
H  4.568625 3.870855 0.775208
H  4.738855 2.287223 1.547909
elementType: S P O C H
totalener: -2950.72183223 hartree
nucrepener: 3264.16318718 hartree
electener: -6214.88501941 hartree
twoeener: 4344.97762697 hartree
cpcmener: -0.03972575 hartree
kineticenergy: 2942.55744161 hartree
xcener: -192.748438578711 hartree
chargesum: -0.0000000
charge: -0.049670 -0.450733 -0.434302 0.771159 0.736066 -0.348574 -0.343420 -0.345480 -0.344907 -0.340618 -0.348733 0.061333 0.051154 0.225138 0.229003 -0.154383 -0.150661 -0.145602 -0.166551 -0.168318 -0.189545 -0.159657 -0.163904 -0.115887 -0.116639 -0.113119 -0.116812 0.151804 0.136182 0.139422 0.154767 0.158135 0.153536 0.157707 0.149215 0.113398 0.131750 0.125913 0.130949 0.111895 0.129371 0.109342 0.131575 0.127021 0.128918 0.129712 0.123049
qa: -0.0497 -0.4507 -0.4343 0.7712 0.7361 -0.3486 -0.3434 -0.3455 -0.3449 -0.3406 -0.3487 0.0613 0.0512 0.2251 0.2290 -0.1544 -0.1507 -0.1456 -0.1666 -0.1683 -0.1895 -0.1597 -0.1639 -0.1159 -0.1166 -0.1131 -0.1168 0.1518 0.1362 0.1394 0.1548 0.1581 0.1535 0.1577 0.1492 0.1134 0.1318 0.1259 0.1309 0.1119 0.1294 0.1093 0.1316 0.1270 0.1289 0.1297 0.1230
va: 2.3435 1.9815 2.0135 5.4760 5.4953 2.1048 2.0592 2.0978 2.0986 2.0864 2.0898 3.7003 3.7700 3.7353 3.7193 3.9533 3.9639 4.0160 3.9271 3.9977 4.0400 3.9983 3.9524 3.8447 3.8383 3.8412 3.8285 0.9953 1.0098 1.0133 0.9920 0.9935 0.9977 1.0046 1.0084 0.9984 0.9913 0.9842 0.9905 0.9995 0.9875 0.9995 0.9899 0.9861 0.9941 0.9890 0.9920
dispcorr: -0.023749254 hartree
energy: -2950.745581486687
dipole: -0.25720 0.22128 -0.03592 7.06581 -5.70177 1.36404 8.27635 -6.05159 2.22476
magnitude: 2.60987 au
magnitude: 6.63377 debye
