program: Orca
programVersion: 5.0.2
elementType: S S S P P O O O O O O C C C C C C C C C C C C C C C C H H H H H H H H H H H H H H H H H H H H
charge: 0
multiplicity: 1
keywords: wb97x-d3
keywords: def2-TZVPP
keywords: def2/J RIJCOSX
keywords: DEFGRID2
keywords: scfconv7
keywords: smallprint printgap noloewdin
keywords: NOSOSCF
formula: C16H20O6P2S3
InChI: InChI=1/C16H20O6P2S3/c1-17-23(25,18-2)21-13-5-9-15(10-6-13)27-16-11-7-14(8-12-16)22-24(26,19-3)20-4/h5-12H,1-4H3
47 atoms
S  -0.058738 -3.879737 0.064592
S  -2.914692 2.086494 1.82347
S  3.948113 0.974872 -3.099804
P  -4.543964 1.364207 1.122176
P  4.627027 1.043399 -1.308997
O  -4.626757 -0.250346 1.034486
O  4.661767 -0.35502 -0.494661
O  -4.949017 1.750994 -0.366781
O  -5.889837 1.685598 1.907812
O  6.166976 1.375158 -1.09458
O  3.909461 2.080822 -0.33136
C  -1.393637 -2.750287 0.351119
C  1.309742 -2.767199 -0.112692
C  -3.533862 -1.054809 0.791133
C  3.527323 -1.1393 -0.382614
C  -2.175429 -2.895555 1.490242
C  1.528041 -1.730157 0.790873
C  -1.700977 -1.757514 -0.575563
C  2.214754 -2.985542 -1.145168
C  -3.251143 -2.047486 1.712234
C  2.631481 -0.90548 0.650437
C  -2.765329 -0.900896 -0.35505
C  3.331316 -2.173278 -1.280636
C  -4.818906 3.095535 -0.848051
C  -5.946359 1.604638 3.33745
C  6.741876 2.519248 -1.739616
C  2.585187 2.584103 -0.54543
H  -1.942358 -3.660646 2.218788
H  0.839128 -1.558565 1.607744
H  -1.108056 -1.645696 -1.473994
H  2.049473 -3.783943 -1.856556
H  -3.857939 -2.153315 2.60198
H  2.804283 -0.102443 1.355243
H  -3.00104 -0.138866 -1.086446
H  4.038067 -2.344918 -2.081277
H  -5.097748 3.075329 -1.897883
H  -3.791467 3.445979 -0.755059
H  -5.485889 3.770182 -0.312274
H  -5.27207 2.328195 3.794292
H  -6.969444 1.837433 3.619237
H  -5.698041 0.602562 3.687001
H  7.789471 2.541818 -1.453429
H  6.66656 2.435484 -2.823605
H  6.261622 3.441282 -1.41188
H  2.468193 3.438038 0.115865
H  2.445814 2.906078 -1.576265
H  1.838253 1.831157 -0.2983
elementType: S P O C H
totalener: -2950.72043518 hartree
nucrepener: 3362.08850571 hartree
electener: -6312.80894089 hartree
twoeener: 4442.84983748 hartree
cpcmener: -0.03574387 hartree
kineticenergy: 2942.55932542 hartree
xcener: -192.748103070546 hartree
chargesum: -0.0000000
charge: -0.062304 -0.450888 -0.454244 0.771117 0.765551 -0.341951 -0.352908 -0.345030 -0.344923 -0.342060 -0.346567 0.033170 0.027134 0.231728 0.255211 -0.136244 -0.119052 -0.127013 -0.133893 -0.182123 -0.211470 -0.170661 -0.190460 -0.116636 -0.116420 -0.121795 -0.095798 0.136940 0.151319 0.149317 0.136364 0.154526 0.165827 0.155251 0.148540 0.131124 0.112031 0.131271 0.112316 0.131555 0.126796 0.131333 0.111945 0.127135 0.131274 0.113027 0.120637
qa: -0.0623 -0.4509 -0.4542 0.7711 0.7656 -0.3420 -0.3529 -0.3450 -0.3449 -0.3421 -0.3466 0.0332 0.0271 0.2317 0.2552 -0.1362 -0.1191 -0.1270 -0.1339 -0.1821 -0.2115 -0.1707 -0.1905 -0.1166 -0.1164 -0.1218 -0.0958 0.1369 0.1513 0.1493 0.1364 0.1545 0.1658 0.1553 0.1485 0.1311 0.1120 0.1313 0.1123 0.1316 0.1268 0.1313 0.1119 0.1271 0.1313 0.1130 0.1206
va: 2.3065 1.9812 1.9837 5.4721 5.4931 2.1116 2.1053 2.0936 2.1006 2.1104 2.0699 3.7104 3.7501 3.7230 3.7047 3.9734 3.8945 3.9528 3.9627 4.0260 3.9905 3.9673 4.0475 3.8342 3.8430 3.8462 3.8173 1.0133 0.9917 0.9955 1.0130 0.9970 0.9932 1.0066 1.0045 0.9904 1.0000 0.9879 0.9992 0.9908 0.9848 0.9906 0.9986 0.9869 0.9917 1.0071 0.9832
dispcorr: -0.024081400 hartree
energy: -2950.744516578839
dipole: -4.69880 3.38831 -1.31049 13.02392 -11.20825 1.81567 2.29877 -1.50173 0.79703
magnitude: 2.37682 au
magnitude: 6.04141 debye
