program: Orca
programVersion: 5.0.2
elementType: S S S P P O O O O O O C C C C C C C C C C C C C C C C H H H H H H H H H H H H H H H H H H H H
charge: 0
multiplicity: 1
keywords: wb97x-d3
keywords: def2-TZVPP
keywords: def2/J RIJCOSX
keywords: DEFGRID2
keywords: scfconv7
keywords: smallprint printgap noloewdin
keywords: NOSOSCF
formula: C16H20O6P2S3
InChI: InChI=1/C16H20O6P2S3/c1-17-23(25,18-2)21-13-5-9-15(10-6-13)27-16-11-7-14(8-12-16)22-24(26,19-3)20-4/h5-12H,1-4H3
47 atoms
S  0.037066 -3.84109 -0.151158
S  -3.547608 1.867824 -0.85019
S  3.322334 2.098483 0.860536
P  -4.744282 1.183318 0.478772
P  4.64056 1.416973 -0.343256
O  -4.710669 -0.418579 0.706034
O  4.688468 -0.204893 -0.461782
O  -6.300798 1.426827 0.251966
O  -4.559025 1.682917 1.979253
O  4.479457 1.961107 -1.826208
O  6.174681 1.711667 -0.041088
C  -1.343526 -2.759051 0.095358
C  1.386652 -2.695635 -0.22566
C  -3.57207 -1.174033 0.508351
C  3.568775 -1.001705 -0.389875
C  -2.498183 -2.970281 -0.648853
C  2.468837 -2.866337 0.628823
C  -1.315806 -1.750526 1.054951
C  1.408001 -1.671719 -1.169144
C  -3.618287 -2.178322 -0.441251
C  3.564636 -2.019013 0.547586
C  -2.425749 -0.949234 1.257371
C  2.493188 -0.816746 -1.248816
C  -6.888091 1.276129 -1.04708
C  -4.384152 3.076061 2.2711
C  5.376669 1.589157 -2.887435
C  6.736304 1.457045 1.253122
H  -2.527803 -3.74353 -1.405477
H  2.459196 -3.652605 1.37219
H  -0.42746 -1.582831 1.649907
H  0.576799 -1.536814 -1.848949
H  -4.515431 -2.336099 -1.025592
H  4.405944 -2.146889 1.216218
H  -2.397357 -0.171734 2.010006
H  2.504621 -0.032716 -1.995287
H  -7.941545 1.519962 -0.940413
H  -6.791424 0.251295 -1.406079
H  -6.430266 1.958131 -1.763145
H  -3.527485 3.483235 1.734305
H  -5.278373 3.64476 2.016405
H  -4.205996 3.148257 3.340324
H  4.897134 1.891236 -3.814191
H  6.326481 2.111758 -2.787113
H  5.549479 0.513806 -2.912778
H  6.181063 1.982531 2.029937
H  6.747452 0.389435 1.47181
H  7.756679 1.828883 1.228144
elementType: S P O C H
totalener: -2950.72174615 hartree
nucrepener: 3349.02693577 hartree
electener: -6299.74868192 hartree
twoeener: 4430.74662550 hartree
cpcmener: -0.03918038 hartree
kineticenergy: 2942.55411093 hartree
xcener: -192.746352644411 hartree
chargesum: 0.0000000
charge: -0.063412 -0.451398 -0.432031 0.771994 0.732186 -0.346858 -0.342615 -0.346096 -0.344730 -0.347872 -0.338261 0.039534 0.031875 0.222008 0.250313 -0.147384 -0.137048 -0.141997 -0.126124 -0.177693 -0.189899 -0.166457 -0.169007 -0.116478 -0.115063 -0.118346 -0.109509 0.136959 0.137169 0.152739 0.150590 0.154498 0.153413 0.154997 0.151210 0.131310 0.127610 0.111817 0.111116 0.128749 0.130736 0.129103 0.127966 0.124833 0.107601 0.127178 0.130774
qa: -0.0634 -0.4514 -0.4320 0.7720 0.7322 -0.3469 -0.3426 -0.3461 -0.3447 -0.3479 -0.3383 0.0395 0.0319 0.2220 0.2503 -0.1474 -0.1370 -0.1420 -0.1261 -0.1777 -0.1899 -0.1665 -0.1690 -0.1165 -0.1151 -0.1183 -0.1095 0.1370 0.1372 0.1527 0.1506 0.1545 0.1534 0.1550 0.1512 0.1313 0.1276 0.1118 0.1111 0.1287 0.1307 0.1291 0.1280 0.1248 0.1076 0.1272 0.1308
va: 2.3079 1.9818 2.0167 5.4723 5.5008 2.1077 2.0583 2.0990 2.0972 2.0907 2.0893 3.7326 3.7117 3.7212 3.6973 3.9725 3.9786 3.9410 3.9408 4.0287 4.0428 3.9685 3.9546 3.8421 3.8372 3.8310 3.8390 1.0134 1.0134 0.9924 0.9951 0.9963 0.9975 1.0072 1.0058 0.9910 0.9845 1.0001 1.0000 0.9885 0.9902 0.9894 0.9937 0.9923 1.0003 0.9876 0.9894
dispcorr: -0.023946040 hartree
energy: -2950.745692195088
dipole: 3.17609 -2.27788 0.89821 4.63531 -4.79395 -0.15864 -1.90717 1.42850 -0.47867
magnitude: 1.03008 au
magnitude: 2.61826 debye
